program: Gaussian 09
title: 000291203
version: EM64L-G09RevD.01
frameworkgroup: C1[X(C12H9NO2)]
method: RPBEPBE
basis: SDD
operation: Freq
keyword: #p
keyword: freq=noraman
keyword: PBEPBE/SDD
title: #p freq=noraman PBEPBE/SDD
converged: YES YES NO NO
title: Mulliken charges:
elementType: O O N C C C C C C C C C C C C H H H H H H H H H
charge: -0.310341 -0.230244 -0.012156 0.218916 -0.326370 -0.326426 0.438797 0.162116 -0.220068 -0.214979 -0.219280 -0.273189 -0.337627 -0.331841 -0.305994 0.270133 0.266927 0.237212 0.234799 0.236333 0.301175 0.252452 0.244253 0.245406
chargesum: 0.00000
title: Mulliken charges with hydrogens summed into heavy atoms:
elementType: O O N C C C C C C C C C C C C
charge: -0.310341 -0.230244 -0.012156 0.218916 -0.056237 -0.059500 0.438797 0.162116 0.017144 0.019820 0.017053 0.027985 -0.085175 -0.087589 -0.060589
polarizability: 2.29713538e+02 1.87256841e+00 1.47355655e+02 -1.08997065e-02 -1.90959964e-01 5.42762287e+01
1716.lowfreq: -6.8699 -1.8474 0.0004 0.0006 0.0006 9.0022 23.0418 40.5464 73.5221
frequency: 22.8996 40.5210 73.5186 86.5426 159.8060 209.8249 248.6847 275.2778 333.6739 376.8583 402.2983 437.0797 452.1951 529.4514 557.2969 613.8365 650.8653 672.9754 674.9538 699.3937 734.0137 762.0096 795.5845 821.9402 831.5595 863.8595 870.0810 956.1740 956.8533 961.2590 975.6508 990.1868 997.0423 1005.0135 1011.2329 1032.8999 1052.6886 1081.1840 1087.3122 1170.8452 1175.9050 1185.2635 1224.5299 1236.2998 1300.7206 1315.8287 1328.9563 1391.3410 1401.8162 1438.6836 1457.6921 1476.8602 1551.7213 1571.9559 1585.1648 1611.0747 1634.5238 3133.7919 3139.3953 3142.7172 3145.9347 3158.0689 3169.7875 3177.6073 3183.8355 3220.6690
redmass: 4.0641 5.6716 8.4362 5.5771 5.1618 6.5676 7.9531 5.4324 8.1820 2.5810 2.8185 3.7177 8.0019 3.1971 9.2166 6.4454 7.0482 5.2084 7.1724 1.6210 3.6346 9.6602 2.1010 6.9033 1.4472 1.2458 1.2474 6.5381 1.4230 1.3775 1.4209 6.3401 1.3878 6.3267 1.3350 2.1557 1.9172 1.5180 1.5904 2.8556 1.0612 1.2474 1.5005 3.6334 3.9064 1.3270 1.6913 9.8904 2.0854 2.2440 1.9428 2.2640 6.3751 6.7879 6.4365 6.0731 11.4661 1.0858 1.0891 1.0924 1.0893 1.0941 1.0985 1.0966 1.0970 1.0950
irintensity: 0.3515 0.1234 1.4953 0.2098 0.1853 1.6153 4.7820 3.3438 5.9704 0.0495 0.0007 0.1220 1.6073 18.8803 13.2885 1.3837 0.2605 15.7493 9.5262 87.8921 0.3111 5.5430 22.2943 21.6277 84.5748 0.0457 2.2868 0.7271 3.1400 2.9425 1.4735 17.4355 0.0626 349.1794 0.2837 77.8427 15.1922 2.9681 11.0668 463.0796 5.0636 1.5217 138.9120 212.3708 9.2109 0.2160 11.3895 3.9581 24.6086 18.7751 81.5471 4.4069 92.8750 74.3441 20.7230 15.6426 182.2676 0.1495 30.5086 9.2791 9.2176 13.7659 21.9753 5.5335 7.4987 4.5433
temp: 298.150 k
press: 1.00000 atm
elementType: 8 8 7 6 6 6 6 6 6 6 6 6 6 6 6 1 1 1 1 1 1 1 1 1
symmnumber: 1
zpe: 471540.9 jmol-1
zpe.correction: 0.179600 hartree
zpe.thermalcorrener: 0.191564 hartree
zpe.thermalcorrenthalpy: 0.192508 hartree
zpe.thermalcorrgfe: 0.139331 hartree
zpe.sumelectzpe: -666.833624 hartree
zpe.sumelectthermal: -666.821660 hartree
zpe.sumelectthermalent: -666.820716 hartree
zpe.sumelectthermalfe: -666.873893 hartree
dipole: 4.2521 1.8351 0.0251
dipole: 4.6312
quadrupole: -86.6048 -77.9151 -90.8239
quadrupole: 1.0603 0.0729 -0.1523
quadrupole: -1.4902 7.1995 -5.7093 1.0603 0.0729 -0.1523
hfenergy: -667.0132242 hartree
pointgroup: C01 [X(C12H9N1O2)]
dipole: -1.6819065 0.2978619 0.6343443 debye
dipolederiv: -2.4674047 -0.1970057 -0.3482424 -0.3997186 -0.2684419 -0.1525574 -0.7801717 -0.1590551 -0.4963269 -0.836558 0.0860811 0.1826451 -0.0451136 -0.4272089 -0.240248 -0.0882062 -0.2447828 -0.7987547 -0.4897292 -0.0089864 -0.0112189 -0.0044413 -0.2667044 -0.0641712 0.0000004 -0.0631595 -0.3769119 -0.7656524 0.0631666 0.1415341 0.0695014 -0.0366905 -0.0283819 0.1552875 -0.0287605 -0.0835908 0.1289616 -0.0693503 -0.14386 0.0729073 -0.0783249 0.0529078 0.1448302 0.0556519 0.0041538 0.1034458 0.0336839 0.0642645 -0.0847591 -0.0869876 0.0408961 -0.1762492 0.0394665 -0.0250926 1.7916859 0.0953723 0.1513877 -0.0033765 0.1529973 0.0444029 -0.0521323 0.0416041 0.2314501 2.6402903 -0.0032526 -0.0508908 0.3882302 0.4661314 0.4120661 0.7699279 0.4252506 1.0989557 -0.0444009 0.0910185 0.1825203 0.1108077 -0.1338573 0.0368776 0.2218513 0.0373521 -0.0817466 -0.2577733 -0.0417368 -0.0820454 -0.0584607 -0.0970641 0.1178833 -0.1149854 0.1176381 0.0845729 0.1255315 -0.0149357 -0.0338213 -0.016477 -0.0925764 0.0717087 -0.0373225 0.0715667 0.0171574 -0.5808906 0.0417311 0.1056536 0.0608251 -0.1116924 -0.0185505 0.1503904 -0.0201671 -0.1520756 -0.5178593 -0.0864178 -0.174356 -0.0832021 -0.1312111 0.0043989 -0.167469 0.0049144 -0.1164531 0.3648016 -0.0632555 -0.1529167 -0.0070314 -0.0163263 0.1490913 -0.0347049 0.1500881 0.2443856 0.3666209 0.0806628 0.158783 0.0178066 -0.0170564 0.1522566 0.0238178 0.1496758 0.2385891 0.1365957 0.0230555 0.0466233 0.0070253 0.1246999 -0.0654008 0.0138364 -0.0659384 0.0238446 0.0720033 -0.0372964 -0.0741327 -0.0452826 0.130835 -0.0451466 -0.0903233 -0.0457669 0.0631549 -0.0437019 -0.0414207 -0.0800433 -0.0482921 0.1283587 -0.0638053 -0.0942093 -0.0639285 0.0330019 0.0608679 0.0153838 0.0326043 0.0298353 0.1090474 -0.102714 0.0618996 -0.1024717 -0.0480122 -0.1059685 0.0241237 0.0529197 0.0257018 0.1420272 -0.0312345 0.0557409 -0.0312674 0.0934111 0.188441 -0.0234302 -0.0503257 -0.0159789 0.1623522 -0.0466608 -0.0368365 -0.0450637 0.0855849 0.0727505 0.0390172 0.0883068 0.0331168 0.1454177 -0.063989 0.0743264 -0.0637564 0.0322687 0.0245203 0.0316079 0.0733148 0.0315803 0.102147 -0.0758194 0.073316 -0.0756333 -0.0312845 0.0334227 -0.0378162 -0.0787037 -0.0352038 0.1001281 -0.08381 -0.0726146 -0.0834572 -0.0402819 unknown
polarizability: 229.7292306|1.2621825|71.6917634|-1.5289532|36.2735915|129.9244276 unknown
InChI: InChI=1S/C12H9NO2/c14-12(10-4-2-1-3-5-10)15-11-6-8-13-9-7-11/h1-9H
charge 0 multiplicity 1
24 atoms
O  0.428894 0.151821 0.248942
O  -0.158445 -0.85618 -1.801162
N  4.681531 0.170387 0.142404
C  -1.893246 -0.113908 -0.258138
C  -2.938188 -0.547987 -1.117483
C  -2.206682 0.499143 0.983966
C  1.840406 0.10927 0.114317
C  -0.494504 -0.328422 -0.718206
C  -4.283086 -0.370377 -0.737696
C  -3.555067 0.674338 1.358409
C  -4.59426 0.241134 0.500747
C  2.56752 -0.386784 -0.993701
C  2.53536 0.632335 1.228919
C  3.979973 -0.327674 -0.917485
C  3.944734 0.640681 1.195151
H  -2.674017 -1.017766 -2.070613
H  -1.39659 0.830522 1.638409
H  -5.086824 -0.705773 -1.401496
H  -3.797282 1.147349 2.315986
H  -5.640455 0.379208 0.795543
H  2.06897 -0.798537 -1.87004
H  1.983197 1.018274 2.089833
H  4.581493 -0.701092 -1.753819
H  4.516266 1.038438 2.040816
