program: Gaussian 09
title: 000291210
version: EM64L-G09RevD.01
frameworkgroup: C1[X(C17H12N2O2)]
method: RPBEPBE
basis: SDD
operation: Freq
keyword: #p
keyword: freq=noraman
keyword: PBEPBE/SDD
title: #p freq=noraman PBEPBE/SDD
converged: NO YES NO NO
title: Mulliken charges:
elementType: O O N N C C C C C C C C C C C C C C C C C H H H H H H H H H H H H
charge: -0.196710 -0.169611 0.021839 -0.005311 0.018483 -0.651396 -0.540952 -0.095062 0.290596 0.284948 0.400880 0.388135 -0.377427 -0.366652 -0.473349 -0.452671 -0.199992 -0.242031 -0.242643 -0.229028 -0.226836 0.278968 0.281162 0.271467 0.284374 0.258639 0.257174 0.250562 0.246953 0.234810 0.233822 0.233597 0.233261
chargesum: 0.00000
title: Mulliken charges with hydrogens summed into heavy atoms:
elementType: O O N N C C C C C C C C C C C C C C C C C
charge: -0.196710 -0.169611 0.021839 -0.005311 0.018483 -0.372428 0.011676 0.189312 0.290596 0.284948 0.400880 0.388135 -0.118788 -0.109478 -0.222787 -0.205718 -0.199992 -0.007221 -0.008820 0.004570 0.006425
polarizability: 2.20656400e+02 3.85197288e-01 1.87714795e+02 2.44093482e+00 5.39935409e+00 1.51439320e+02
1716.lowfreq: -6.2368 -1.3989 0.0005 0.0006 0.0006 8.1320 50.5840 60.0443 63.3621
frequency: 50.5811 60.0402 63.3572 103.8315 132.8910 135.7257 154.5732 175.6366 178.5135 259.8694 295.9030 319.9622 336.8812 345.1138 385.3724 386.2348 389.3570 445.4917 469.1565 493.0135 513.2890 548.1763 561.5020 581.3916 609.1155 632.4503 656.1642 669.6680 710.5141 737.5428 748.2584 761.2619 766.0970 782.5497 824.0994 836.4204 853.1447 860.1854 880.5914 891.4835 930.2331 950.5437 952.6280 981.7834 992.1348 992.9227 1021.8335 1025.9550 1029.0352 1040.6473 1055.2164 1092.5645 1123.2210 1151.9437 1164.2583 1180.1756 1180.2998 1184.0988 1195.2529 1212.2725 1225.1193 1230.6180 1240.6356 1279.6252 1292.5356 1298.1885 1319.9563 1323.1181 1388.4588 1389.6294 1399.0681 1446.7186 1448.6885 1461.4114 1462.9535 1480.7208 1590.8339 1598.8070 1610.7042 1619.9763 2194.7126 3018.0422 3045.6457 3074.0730 3113.8615 3129.8570 3131.9214 3141.8324 3142.5936 3155.8501 3156.4055 3170.2145 3170.5480
redmass: 11.2144 7.7533 6.2623 7.5497 5.0322 4.0478 6.6526 5.6080 5.1538 3.6357 6.2071 3.8327 8.6665 3.9957 7.5740 7.9658 4.9869 3.4226 5.2900 5.5006 4.8403 4.4535 5.5078 4.5300 4.0952 5.2989 6.3518 7.4599 5.3061 9.1618 4.5259 1.2517 1.5502 2.7871 2.8739 3.8003 3.9283 3.3074 1.4169 1.7028 4.2436 1.4024 1.4738 4.1239 1.3258 1.3289 3.6027 4.8615 2.5703 2.4291 3.5832 2.3271 1.9977 1.5203 1.8061 1.1196 1.1425 1.6637 1.3401 1.9248 2.1121 4.5635 1.8107 1.5210 1.3663 1.4082 1.4730 1.5703 7.8599 6.3090 11.3855 2.3639 2.5291 2.1680 1.1830 2.3528 6.4895 7.1764 6.8138 6.9741 12.5639 1.0832 1.0605 1.0883 1.1061 1.0869 1.0865 1.0896 1.0900 1.0942 1.0944 1.1001 1.1002
irintensity: 1.0520 2.5610 1.3376 3.7170 0.4083 0.3097 5.2417 0.2089 0.2264 0.2088 1.9345 0.6329 1.4842 1.7292 0.1710 0.6371 0.0084 2.5475 4.7520 1.2264 1.8979 11.6541 1.9676 9.2187 11.1392 13.3316 7.4534 0.7383 8.9248 20.4814 3.1196 34.7007 74.2925 17.4627 0.4306 1.6188 2.2361 0.1901 0.5569 0.2649 0.3760 0.3890 0.6044 1.9984 0.0315 0.0485 4.0200 8.0786 7.0183 1.2596 1.2282 1.1278 7.1745 4.0718 0.4561 0.3829 2.1436 0.5221 1.7437 8.8118 18.6028 50.6522 0.2380 4.3007 5.4370 4.8130 4.6926 2.9637 28.1314 9.9334 111.7835 17.6325 4.3553 32.6702 14.3304 7.3215 0.2293 0.5413 0.0626 0.7933 13.3200 6.3107 6.3133 13.3305 8.4575 1.6431 0.9128 7.0985 8.9756 10.9941 17.1393 31.7775 9.8485
temp: 298.150 k
press: 1.00000 atm
elementType: 8 8 7 7 6 6 6 6 6 6 6 6 6 6 6 6 6 6 6 6 6 1 1 1 1 1 1 1 1 1 1 1 1
symmnumber: 1
zpe: 650862.8 jmol-1
zpe.correction: 0.247901 hartree
zpe.thermalcorrener: 0.263848 hartree
zpe.thermalcorrenthalpy: 0.264793 hartree
zpe.thermalcorrgfe: 0.204682 hartree
zpe.sumelectzpe: -913.431604 hartree
zpe.sumelectthermal: -913.415657 hartree
zpe.sumelectthermalent: -913.414712 hartree
zpe.sumelectthermalfe: -913.474823 hartree
dipole: 2.4466 -2.4191 -2.6853
dipole: 4.3645
quadrupole: -118.9319 -124.0447 -126.0387
quadrupole: -13.8310 11.5331 3.3283
quadrupole: 4.0732 -1.0396 -3.0336 -13.8310 11.5331 3.3283
hfenergy: -913.679505 hartree
pointgroup: C01 [X(C17H12N2O2)]
dipole: 1.0083407 0.8561002 1.0949318 debye
polarizability: 220.3550271|0.0945861|186.5299446|-5.1339908|8.4191518|152.925543 unknown
InChI: InChI=1S/C17H12N2O2/c18-10-11-9-17(19(20)21)14-7-3-1-5-12(14)16(11)13-6-2-4-8-15(13)17/h1-8,11,16H,9H2
charge 0 multiplicity 1
33 atoms
O  1.05311 -3.022029 -0.257496
O  0.493348 -2.457009 -2.387819
N  0.632227 -2.184472 -1.13891
N  -2.953902 2.408455 -2.002846
C  0.278015 -0.773743 -0.652599
C  -0.306688 1.598812 0.242738
C  -0.222061 0.099157 -1.857434
C  -0.518448 1.554834 -1.333865
C  1.494774 -0.068795 -0.02963
C  -0.856208 -0.804058 0.385714
C  1.156796 1.225464 0.449004
C  -1.175097 0.50183 0.84498
C  2.812558 -0.550788 0.073859
C  -1.573613 -1.923205 0.846132
C  2.14202 2.042727 1.033953
C  -2.219748 0.690483 1.768548
C  -1.866807 2.01522 -1.707853
C  3.800791 0.274667 0.664075
C  -2.621461 -1.728666 1.77882
C  3.469621 1.562493 1.143339
C  -2.944297 -0.43136 2.237592
H  -0.550307 2.598661 0.635603
H  -1.127021 -0.361603 -2.282808
H  0.547812 0.12064 -2.644557
H  0.209172 2.256211 -1.783355
H  3.075257 -1.553755 -0.275429
H  -1.322501 -2.933057 0.508173
H  1.879947 3.039762 1.405851
H  -2.471395 1.698592 2.116135
H  4.827944 -0.093986 0.756322
H  -3.182915 -2.593276 2.14852
H  4.241386 2.189043 1.603217
H  -3.758706 -0.293849 2.956828
