program: Gaussian 09
title: 000291202
version: EM64L-G09RevD.01
frameworkgroup: C1[X(C13H12S2)]
method: RPBEPBE
basis: SDD
operation: Freq
keyword: #pfreq=noraman
keyword: PBEPBE/SDD
title: #p freq=noraman PBEPBE/SDD
converged: YES YES NO NO
title: Mulliken charges:
elementType: S S C C C C C C C C C C C C C H H H H H H H H H H H H
charge: 0.211510 0.233337 -0.946548 0.611646 -0.621106 -0.630466 0.371263 -0.506354 0.382931 -0.457815 -0.412412 -0.423005 -0.406909 -0.242096 -0.240630 0.332410 0.274760 0.260730 0.271666 0.266298 0.265243 0.233284 0.237204 0.241072 0.237784 0.228285 0.227919
chargesum: 0.00000
title: Mulliken charges with hydrogens summed into heavy atoms:
elementType: S S C C C C C C C C C C C C C
charge: 0.211510 0.233337 -0.614138 0.611646 -0.085617 -0.092502 0.371263 -0.241111 0.382931 -0.224531 -0.175208 -0.181933 -0.169125 -0.013810 -0.012711
polarizability: 2.72479195e+02 -2.45749996e+00 1.61143098e+02 8.62499439e-01 -5.44331771e+00 1.05504394e+02
1716.lowfreq: -15.0887 -12.4895 -3.7804 -0.0031 -0.0018 0.0011 11.1886 25.5751 58.6601
frequency: 10.5396 25.3717 58.6492 117.8123 153.9543 182.0820 226.0563 233.8697 305.7442 361.9590 398.3425 401.6081 436.9745 477.2881 492.8769 510.1385 516.7784 619.7402 620.2628 628.7796 636.9120 661.9320 701.9968 749.7471 759.0144 764.0407 785.4725 833.0003 851.1791 876.0232 897.3646 918.7150 948.0666 960.2859 961.4001 975.3925 992.6979 1001.8565 1021.6567 1103.2560 1125.1374 1141.2703 1154.4835 1167.4358 1170.7384 1174.4900 1214.6049 1239.0403 1261.3614 1272.8786 1278.6581 1290.5189 1362.2654 1409.2381 1424.4300 1430.0002 1433.4167 1441.9657 1463.9156 1513.6616 1580.2949 1603.6544 1639.8852 3023.4810 3031.9691 3061.4404 3095.1319 3113.6319 3118.7172 3120.1243 3125.7900 3135.5863 3142.5866 3143.5384 3161.8409
redmass: 5.2935 3.6266 6.6226 7.7136 6.4428 3.6329 2.5002 4.5775 5.0705 7.2703 6.0966 3.1615 3.6262 2.4693 6.7579 6.9355 4.0432 6.0014 6.5162 4.5234 3.8353 5.6101 2.6750 5.3015 4.8643 1.4772 2.5612 1.3439 1.5629 1.5693 4.8512 1.7204 1.8447 1.5219 2.1835 1.4044 1.3449 2.4526 2.2614 1.0484 1.7357 1.3541 1.5288 1.0820 1.1834 1.2040 1.3537 1.7816 1.2427 1.8086 1.9345 1.1866 1.6590 5.1911 3.2865 1.1169 3.2476 1.1024 2.5190 3.6705 7.2861 5.5709 6.8179 1.0553 1.0587 1.0871 1.1076 1.1086 1.0866 1.0857 1.0889 1.0918 1.0955 1.0969 1.1004
irintensity: 0.0501 3.1229 1.3238 1.6095 0.0887 0.9206 0.8332 1.3865 1.5652 0.4728 1.7757 0.0586 0.1401 23.1735 10.9268 0.2235 0.4326 3.5432 1.6939 3.3767 1.1522 2.0709 8.9896 18.4729 0.2862 72.4959 2.9750 30.6321 7.4140 24.6087 0.7448 6.7265 7.3273 1.6614 1.8875 5.0467 0.0091 5.4135 5.2325 0.7648 13.8081 0.5699 8.5122 8.5330 2.1659 9.0109 8.3444 0.4262 4.2543 3.9008 12.6468 13.0314 10.8960 2.6158 0.2564 13.7600 0.6356 3.6922 0.7265 8.9118 0.2602 5.7955 0.1777 17.4221 46.1532 9.7742 0.5174 19.1534 4.0137 4.6321 0.2178 5.8312 16.2011 42.2101 37.1132
temp: 298.150 k
press: 1.00000 atm
elementType: 16 16 6 6 6 6 6 6 6 6 6 6 6 6 6 1 1 1 1 1 1 1 1 1 1 1 1
symmnumber: 1
zpe: 551753.7 jmol-1
zpe.correction: 0.210152 hartree
zpe.thermalcorrener: 0.223168 hartree
zpe.thermalcorrenthalpy: 0.224112 hartree
zpe.thermalcorrgfe: 0.167661 hartree
zpe.sumelectzpe: -1297.657011 hartree
zpe.sumelectthermal: -1297.643995 hartree
zpe.sumelectthermalent: -1297.643051 hartree
zpe.sumelectthermalfe: -1297.699502 hartree
dipole: -0.9711 -0.1588 0.3194
dipole: 1.0345
quadrupole: -80.8547 -92.4505 -113.3088
quadrupole: 3.2768 -1.4954 -3.0800
quadrupole: 14.6833 3.0875 -17.7708 3.2768 -1.4954 -3.0800
hfenergy: -1297.8671629 hartree
pointgroup: C01 [X(C13H12S2)]
dipole: -0.3795755 -0.0927376 0.1138902 debye
polarizability: 272.482961|1.9372876|161.6090506|1.9110477|1.4950229|105.0346756 unknown
InChI: InChI=1S/C13H12S2/c1-2-4-11-9-12(6-5-10(11)3-1)13-14-7-8-15-13/h1-6,9,13H,7-8H2
charge 0 multiplicity 1
27 atoms
S  -2.963562 -0.388368 -1.589287
S  -2.969684 -0.136831 1.498765
C  -2.251916 0.61126 -0.097906
C  -0.741312 0.625819 -0.064452
C  -4.278536 -1.352121 -0.615491
C  -4.604462 -0.587616 0.672451
C  1.43704 -0.527827 -0.007154
C  0.008258 -0.556798 -0.05208
C  2.118785 0.752576 0.02461
C  -0.06112 1.889243 -0.035298
C  1.332539 1.950289 0.008681
C  2.221077 -1.730813 0.005253
C  3.552473 0.778278 0.067711
C  3.61518 -1.674482 0.047992
C  4.287082 -0.409132 0.079533
H  -2.652744 1.631734 -0.19648
H  -3.882096 -2.355107 -0.393269
H  -5.163058 -1.430356 -1.27081
H  -5.170104 0.335571 0.464438
H  -5.163013 -1.211264 1.391675
H  -0.51138 -1.521166 -0.088885
H  -0.651665 2.813225 -0.045855
H  1.841243 2.921271 0.030289
H  1.705628 -2.698328 -0.019921
H  4.065171 1.747498 0.091394
H  4.20406 -2.598229 0.05713
H  5.381811 -0.379726 0.112563
