program: Gaussian 09
title: 000291205
version: EM64L-G09RevD.01
frameworkgroup: C1[X(C15H12N2O7)]
method: RPBEPBE
basis: SDD
operation: Freq
keyword: #p
keyword: freq=noraman
keyword: PBEPBE/SDD
title: #p freq=noraman PBEPBE/SDD
converged: YES YES NO NO
title: Mulliken charges:
elementType: O O O O O O O N N C C C C C C C C C C C C C C C H H H H H H H H H H H H
charge: -0.189360 -0.166669 -0.141560 -0.136272 -0.154801 -0.120187 -0.115273 0.217817 0.209818 -0.336796 -0.324258 0.191161 0.491070 0.498610 -0.455580 -0.415677 -0.340940 -0.347403 -0.222822 -0.226840 -0.215437 -0.224667 -0.234964 -0.232395 0.300618 0.261689 0.245032 0.233865 0.261078 0.279014 0.235608 0.233707 0.235270 0.235346 0.236742 0.235455
chargesum: 0.00000
title: Mulliken charges with hydrogens summed into heavy atoms:
elementType: O O O O O O O N N C C C C C C C C C C C C C C C
charge: -0.189360 -0.166669 -0.141560 -0.136272 -0.154801 -0.120187 -0.115273 0.217817 0.209818 -0.036177 -0.062569 0.191161 0.491070 0.498610 -0.210548 -0.181812 -0.079861 -0.068389 0.012786 0.006867 0.019833 0.010679 0.001778 0.003060
polarizability: 2.59895326e+02 3.23078390e+01 1.72358321e+02 -4.16544286e+00 1.30675919e+01 1.87518746e+02
1716.lowfreq: -0.2957 0.0005 0.0005 0.0006 3.1314 8.4320 16.9588 27.6042 31.7356
frequency: 16.8265 27.5780 31.7274 38.6406 49.6659 53.3206 63.7291 73.9752 74.9908 88.0364 106.6105 131.6010 181.5439 211.5117 223.5352 243.4478 253.8962 270.2018 307.2348 324.3754 325.1204 400.6460 401.4579 454.8243 470.5650 485.9099 522.5478 552.3085 581.0830 602.3573 612.9443 614.0597 626.0763 631.6219 637.8480 660.3398 699.3531 702.2382 735.5380 742.5264 749.1975 769.8780 782.4815 833.5093 853.6949 856.2702 863.6194 895.3467 901.5060 928.7571 934.9277 961.4869 982.2690 982.7501 990.4751 991.0056 1003.0645 1004.1599 1026.5787 1027.4199 1051.1515 1084.2159 1087.2285 1158.6576 1167.8729 1175.8754 1176.4475 1184.5025 1189.4286 1192.5839 1194.7482 1237.2530 1256.7508 1285.2378 1311.6718 1331.8027 1334.6185 1385.7749 1387.1715 1443.0353 1443.2262 1481.0859 1483.4668 1524.3799 1543.6260 1592.7398 1593.5003 1608.5090 1610.9664 1647.2583 3000.9009 3041.7378 3122.5675 3126.1082 3134.4712 3135.4312 3144.3140 3147.9273 3155.8310 3159.0587 3170.5366 3171.0625
redmass: 6.9550 7.7884 4.0978 4.9280 9.6464 5.9054 10.6079 11.9876 7.7457 9.9186 7.5148 10.0517 6.1475 8.8759 7.8422 5.7381 6.8520 5.9142 10.6715 5.5553 12.0969 2.8096 2.8033 5.7688 4.9578 6.5997 7.4608 5.2522 8.2148 7.1896 6.5536 6.6235 12.3001 9.9376 8.9643 6.2576 1.7924 1.8458 10.3218 5.8675 5.1846 2.0106 2.4808 5.0011 1.2532 1.2495 4.4792 4.8413 4.9524 1.6604 1.7363 4.1623 1.3953 1.3930 6.2505 6.0483 1.3302 1.3324 2.2530 2.1860 3.3778 1.6297 1.6246 9.6367 3.7513 1.0659 1.0897 1.5510 1.4330 1.1984 1.4809 2.5513 2.0256 1.2645 1.2553 1.2728 1.2699 8.6212 8.2951 2.1837 2.1797 2.2387 2.2828 14.3764 14.2571 6.0793 6.1302 5.9654 6.0391 10.3879 1.0816 1.0852 1.0885 1.0875 1.0868 1.0878 1.0918 1.0920 1.0965 1.0964 1.1016 1.1014
irintensity: 0.1909 0.1551 0.3049 0.1465 0.0812 0.1110 0.0583 0.2358 0.1939 0.0556 1.1610 2.0629 0.2383 1.5956 0.1356 1.8914 1.1284 2.2917 1.4930 0.5228 4.1795 0.9696 0.2081 2.0666 3.2103 4.8450 35.7221 21.3145 38.1298 14.4919 1.8678 1.3830 1.9708 2.5847 12.7083 27.9583 74.9978 45.0521 47.0848 202.3526 226.3917 68.3075 20.8818 3.5455 0.6100 0.2438 26.2058 15.8768 37.6512 15.6378 7.2841 43.3043 0.2235 0.2012 1.5579 2.2939 0.0612 0.0489 2.7357 4.8641 47.9451 5.0702 17.2773 116.2294 267.9277 0.6745 12.5332 75.3627 34.2378 7.3405 36.9257 5.8921 10.7670 5.7568 10.9349 1.0050 2.4885 1.1992 1.2875 10.7348 8.0727 10.6680 11.3240 338.2311 200.3371 1.4055 1.6118 0.7001 0.9011 65.3886 4.7233 7.8731 3.4970 3.2460 0.1839 1.7402 9.4591 16.6509 20.3763 12.6190 15.2788 19.0647
temp: 298.150 k
press: 1.00000 atm
elementType: 8 8 8 8 8 8 8 7 7 6 6 6 6 6 6 6 6 6 6 6 6 6 6 6 1 1 1 1 1 1 1 1 1 1 1 1
symmnumber: 1
zpe: 659411.2 jmol-1
zpe.correction: 0.251156 hartree
zpe.thermalcorrener: 0.272786 hartree
zpe.thermalcorrenthalpy: 0.273731 hartree
zpe.thermalcorrgfe: 0.196409 hartree
zpe.sumelectzpe: -1212.888262 hartree
zpe.sumelectthermal: -1212.866632 hartree
zpe.sumelectthermalent: -1212.865688 hartree
zpe.sumelectthermalfe: -1212.943009 hartree
dipole: 7.0637 2.7986 2.4360
dipole: 7.9789
quadrupole: -135.4252 -147.3174 -130.0691
quadrupole: 2.6453 -6.5416 10.5417
quadrupole: 2.1787 -9.7135 7.5348 2.6453 -6.5416 10.5417
hfenergy: -1213.1394184 hartree
pointgroup: C01 [X(C15H12N2O7)]
dipole: 0.4938779 2.8719699 1.1670541 debye
polarizability: 162.2032135|20.5285084|266.2714803|-8.2469173|6.9287089|191.2976998 unknown
InChI: InChI=1S/C15H12N2O7/c18-13(14(23-16(19)20)11-7-3-1-4-8-11)15(24-17(21)22)12-9-5-2-6-10-12/h1-10,14-15H
charge 0 multiplicity 1
36 atoms
O  -2.622325 -0.889651 -0.650374
O  2.195099 -1.663614 0.080197
O  -0.132729 -1.570848 -1.6159
O  -2.319626 -3.223832 -0.172019
O  0.694011 -2.942709 1.433963
O  -3.78261 -2.5414 -1.802402
O  2.64481 -3.870946 0.65868
N  -2.923025 -2.387497 -0.905432
N  1.79561 -2.961561 0.796166
C  -1.46463 -0.6848 0.249317
C  1.154758 -0.599391 0.236835
C  -0.14693 -1.012813 -0.499046
C  -1.562634 0.756787 0.718331
C  1.793473 0.642275 -0.36509
C  -1.646147 1.054118 2.100357
C  2.096216 1.74912 0.464934
C  -1.574714 1.810546 -0.230739
C  2.110332 0.685016 -1.746731
C  -1.72546 2.396553 2.533294
C  2.704596 2.898312 -0.083518
C  -1.665794 3.14913 0.2032
C  2.724465 1.833514 -2.289391
C  -1.735481 3.445682 1.585096
C  3.020587 2.942197 -1.461457
H  -1.526962 -1.386825 1.105083
H  0.951756 -0.454623 1.312561
H  -1.659151 0.240227 2.835588
H  1.849394 1.715856 1.532766
H  -1.523132 1.57967 -1.300412
H  1.881267 -0.176922 -2.382041
H  -1.79079 2.621707 3.603193
H  2.934374 3.753589 0.560792
H  -1.679165 3.960163 -0.532401
H  2.974362 1.863424 -3.355249
H  -1.803981 4.4864 1.920257
H  3.496975 3.832648 -1.886309
