program: Gaussian 09
title: 000291331
version: EM64L-G09RevD.01
frameworkgroup: C1[X(C28H22OS4)]
method: RPBEPBE
basis: SDD
operation: Freq
keyword: #p
keyword: freq=noraman
keyword: PBEPBE/SDD
title: #p freq=noraman PBEPBE/SDD
converged: YES YES NO NO
title: Mulliken charges:
elementType: S S S S O C C C C C C C C C C C C C C C C C C C C C C C C C C C C H H H H H H H H H H H H H H H H H H H H H H
charge: 0.261288 0.336394 0.181176 0.210065 -0.207975 -0.765037 0.393063 0.427703 0.203394 0.180130 -0.014626 -0.341229 -0.423621 -0.417048 -0.433437 -0.272351 -0.138498 -0.233227 -0.268030 -0.179372 -0.277778 -0.193144 -0.224747 -0.252337 -0.239174 -0.229644 -0.161006 -0.153546 -0.220443 -0.197464 -0.214510 -0.865177 -0.863845 0.254599 0.239383 0.244339 0.242915 0.262358 0.265484 0.235345 0.232289 0.254592 0.276915 0.256090 0.262325 0.240609 0.245336 0.238626 0.245394 0.278931 0.267955 0.254856 0.263877 0.268118 0.263715
chargesum: 0.00000
title: Mulliken charges with hydrogens summed into heavy atoms:
elementType: S S S S O C C C C C C C C C C C C C C C C C C C C C C C C C C C C
charge: 0.261288 0.336394 0.181176 0.210065 -0.207975 -0.271055 0.393063 0.427703 0.203394 0.180130 -0.014626 -0.341229 -0.423621 -0.172709 -0.190521 -0.009994 0.126986 0.002118 -0.035741 -0.179372 -0.277778 0.061448 0.052168 0.003753 0.023152 0.010966 0.084330 0.085080 0.024952 -0.197464 -0.214510 -0.063435 -0.068135
polarizability: 6.02397094e+02 3.81723540e+01 3.30979631e+02 7.52829728e+00 2.94049137e+01 2.69053581e+02
1716.lowfreq: -3.9797 -0.0024 -0.0018 -0.0012 2.4244 6.4218 13.8747 17.4192 26.7810
frequency: 13.8630 17.3464 26.7595 28.5454 34.6017 41.4156 47.3787 53.9367 59.0828 62.1932 74.1808 104.4537 120.8957 125.3359 149.0807 162.8301 180.6099 184.7286 190.7489 208.3900 220.8580 223.7265 240.4954 251.0930 263.0999 273.6581 282.2347 303.8882 318.6759 325.6958 341.2276 359.7756 365.9399 382.2133 397.5250 403.5578 405.4130 422.1201 439.8194 463.8231 488.8321 491.8599 497.4702 500.9333 510.6931 531.5561 546.6469 553.9617 579.7106 623.1151 623.1667 628.9773 667.7796 670.3011 671.3470 672.3555 700.1519 709.1394 714.0219 715.7930 733.1610 743.5417 775.2682 793.9159 796.7324 817.6534 826.2262 827.2492 837.5632 877.6041 880.6521 896.7968 908.2077 917.2195 945.0878 951.6976 956.5246 960.8268 967.0032 970.5845 973.2316 983.3883 985.4096 986.4022 987.0428 998.4386 999.1067 1060.2061 1063.7619 1068.5455 1081.1663 1082.1381 1083.1285 1113.9691 1117.5400 1123.0997 1134.9311 1159.3832 1188.5023 1191.6427 1192.1317 1193.7849 1197.0771 1215.1592 1234.5387 1272.1615 1290.1952 1293.6522 1328.6969 1342.1407 1346.2408 1351.9818 1353.8810 1369.7402 1374.7710 1390.1099 1395.1169 1414.1484 1424.6409 1428.6450 1443.7126 1448.8814 1453.7001 1454.8075 1457.6821 1459.5456 1465.8406 1467.0021 1531.4998 1560.6518 1564.5241 1568.1851 1580.0161 1584.2299 1586.2067 1590.0280 1596.3495 2941.7731 3006.5260 3008.2446 3018.9374 3124.3129 3124.7360 3124.8819 3125.0485 3130.0062 3132.6215 3133.3271 3135.0239 3138.6391 3142.5061 3146.3110 3150.3979 3153.8741 3156.2057 3160.4705 3163.0256 3168.6243 3171.6074
redmass: 6.9743 6.5349 4.1601 5.3748 6.0945 4.3108 4.7071 4.2187 4.5858 3.8380 6.5325 7.6010 7.1118 6.4825 4.5614 4.7505 8.2338 4.1171 4.2265 2.5731 1.1583 1.1746 5.3454 5.5059 5.7026 5.7156 6.1108 5.3144 7.2011 7.0286 9.9685 5.6142 5.4553 8.5511 5.7745 3.1933 3.0503 5.5550 4.4155 6.2434 3.7685 5.5786 4.9456 4.1746 4.4716 4.1118 4.7828 7.2475 5.0854 7.1208 7.1334 5.4411 4.8697 7.2580 7.1514 6.1974 4.0688 5.3431 7.0775 5.2763 4.1008 4.6211 1.8308 1.5218 2.3792 1.4741 1.3418 1.3869 1.2597 3.8214 5.0290 1.8147 1.3675 7.0567 1.3367 2.0609 1.3155 1.3730 1.1858 1.2831 1.2566 1.3615 1.4366 1.7073 1.7417 2.2660 2.2653 7.5331 7.2750 2.9757 2.0920 2.0647 2.0382 1.3996 1.4175 2.7247 3.7878 1.8353 1.1821 1.4451 1.1511 1.1280 1.2306 1.3710 1.9077 3.3765 1.2532 1.2530 2.4624 2.3220 1.7345 1.5077 1.9610 7.8791 7.2441 3.6782 3.8316 2.4759 2.4006 1.5784 2.4535 1.9419 1.0526 1.0526 1.6053 1.3983 1.2493 1.4126 9.0502 7.1317 6.6099 7.2225 6.1592 6.6656 6.3639 6.4654 6.8554 1.0679 1.0290 1.0291 1.0898 1.0876 1.0874 1.1064 1.1061 1.0879 1.1020 1.0882 1.1002 1.0904 1.0909 1.0930 1.0876 1.0965 1.0959 1.0964 1.0993 1.0960 1.0968
irintensity: 0.1101 0.6139 1.6875 0.6992 0.7186 0.5035 0.7364 0.5901 0.7574 3.5127 0.0897 1.4006 3.8833 0.7761 3.0920 0.0888 0.5688 1.6017 0.6924 5.6769 0.4214 0.2974 0.8258 0.8423 1.1263 0.8908 0.7256 0.7452 14.1733 6.6901 7.9403 0.2693 2.1098 2.1314 1.6660 0.4452 0.6316 4.7039 6.4035 3.7886 31.4382 2.3929 15.7587 1.0981 1.7146 24.3607 1.2843 2.4968 6.2912 0.4717 0.1132 2.6236 20.8880 2.3991 0.3651 27.1774 0.6766 3.2167 5.1339 11.1796 1.9026 5.6361 48.5789 1.5003 39.8348 62.0327 19.1246 39.5110 4.6640 35.2482 14.1165 7.5284 1.1449 23.4113 1.0807 8.5325 2.7073 0.9428 6.1940 8.1025 4.2613 0.5353 5.2071 14.9365 40.3030 7.9086 22.6362 43.7238 19.4071 11.6107 6.0632 46.7342 4.2956 6.5396 5.9468 3.6600 19.2455 5.3371 0.8370 9.1563 6.7395 4.0772 4.1653 1.1529 2.4760 188.6156 0.1662 1.3505 29.8763 2.9523 3.8563 4.2981 8.6810 18.2176 20.1963 5.1388 4.6756 29.7447 45.5865 57.1060 30.1983 0.9340 4.6898 27.6979 72.4807 108.4567 2.8038 11.3915 58.7518 0.1607 8.0942 6.9111 39.0194 92.0062 71.7146 79.5258 2.7976 8.6533 23.0900 23.1696 10.8145 3.1131 9.3272 19.9829 11.4270 4.6362 7.9553 6.7778 10.0797 1.1956 10.3487 17.2540 4.2656 7.1128 11.1145 1.9455 30.2554 11.4682 3.6160
temp: 298.150 k
press: 1.00000 atm
elementType: 16 16 16 16 8 6 6 6 6 6 6 6 6 6 6 6 6 6 6 6 6 6 6 6 6 6 6 6 6 6 6 6 6 1 1 1 1 1 1 1 1 1 1 1 1 1 1 1 1 1 1 1 1 1 1
symmnumber: 1
zpe: 1077909.3 jmol-1
zpe.correction: 0.410554 hartree
zpe.thermalcorrener: 0.441571 hartree
zpe.thermalcorrenthalpy: 0.442515 hartree
zpe.thermalcorrgfe: 0.344757 hartree
zpe.sumelectzpe: -2745.359738 hartree
zpe.sumelectthermal: -2745.328721 hartree
zpe.sumelectthermalent: -2745.327777 hartree
zpe.sumelectthermalfe: -2745.425535 hartree
dipole: 1.1754 -2.1586 -3.8451
dipole: 4.5635
quadrupole: -188.8494 -209.8846 -219.6576
quadrupole: 18.9535 5.4685 8.1864
quadrupole: 17.2812 -3.7541 -13.5271 18.9535 5.4685 8.1864
hfenergy: -2745.7702921 hartree
pointgroup: C01 [X(C28H22O1S4)]
dipole: 0.5812345 0.6684848 1.5616857 debye
polarizability: 538.6087307|-120.7252096|392.2178237|33.7452473|14.9514276|271.6037511 unknown
InChI: InChI=1S/C28H22OS4/c1-30-20-9-13-22(14-10-20)32-24-7-3-5-18-17-19-6-4-8-25(27(19)28(29)26(18)24)33-23-15-11-21(31-2)12-16-23/h3-16H,17H2,1-2H3
charge 0 multiplicity 1
55 atoms
S  -4.143768 -0.805142 -1.461645
S  1.146479 0.091973 -1.228106
S  0.412325 -4.067892 1.838634
S  7.027572 -1.823663 0.831335
O  -1.452957 0.580243 -1.747792
C  -2.207562 3.873369 0.678756
C  -3.345247 2.93794 0.314726
C  -0.819228 3.269658 0.651224
C  -3.097052 1.704609 -0.363208
C  -0.568779 2.094745 -0.119286
C  -1.694572 1.406904 -0.809645
C  -4.213317 0.852528 -0.655514
C  0.772043 1.585424 -0.205802
C  -4.666905 3.338568 0.619264
C  0.232253 3.912524 1.336748
C  -5.527276 1.271691 -0.343103
C  1.810278 2.242134 0.495382
C  -5.758871 2.520222 0.272335
C  1.541556 3.393477 1.262364
C  -2.827304 -1.690813 -0.530454
C  2.813202 -0.376693 -0.558109
C  -2.787197 -1.675574 0.883644
C  2.911229 -1.145149 0.62411
C  -1.88632 -2.451957 -1.253987
C  3.982802 -0.079155 -1.297968
C  -1.792679 -2.403246 1.566675
C  4.170178 -1.597357 1.080083
C  -0.90553 -3.204304 -0.57036
C  5.241554 -0.532582 -0.850398
C  -0.845519 -3.173273 0.841612
C  5.342647 -1.291051 0.345948
C  1.44217 -4.92051 0.521228
C  6.72213 -2.715384 2.453337
H  -2.225021 4.731384 -0.029108
H  -2.402317 4.315651 1.674231
H  -4.834553 4.293185 1.131742
H  0.02764 4.815821 1.922824
H  -6.363363 0.599528 -0.561236
H  2.831166 1.854706 0.44194
H  -6.782605 2.830597 0.507063
H  2.361727 3.887145 1.795253
H  -3.524328 -1.096708 1.450107
H  2.007586 -1.398589 1.189199
H  -1.894448 -2.431525 -2.347491
H  3.908702 0.506101 -2.220485
H  -1.761284 -2.379943 2.6620
H  4.214189 -2.189551 1.999305
H  -0.17971 -3.775621 -1.156296
H  6.141736 -0.29539 -1.428571
H  1.93245 -4.178235 -0.12772
H  0.821028 -5.612556 -0.068441
H  2.205891 -5.491999 1.071027
H  6.085233 -3.600511 2.300431
H  6.274954 -2.034283 3.194006
H  7.716593 -3.03477 2.800889
