program: Gaussian 09
title: 000291188
version: EM64L-G09RevD.01
frameworkgroup: C1[X(C12H15Cl3)]
method: RPBEPBE
basis: SDD
operation: Freq
keyword: #p
keyword: freq=noraman
keyword: PBEPBE/SDD
title: #p freq=noraman PBEPBE/SDD
converged: YES YES NO NO
title: Mulliken charges:
elementType: Cl Cl Cl C C C C C C C C C C C C H H H H H H H H H H H H H H H
charge: -0.084093 -0.084062 -0.084261 0.308126 0.310070 0.309274 0.163415 0.160484 0.164160 -0.883252 -0.882883 -0.883009 -0.868147 -0.867714 -0.867682 0.294654 0.294804 0.294837 0.294928 0.295075 0.294704 0.268073 0.268407 0.237047 0.268109 0.236975 0.268265 0.236953 0.268544 0.268199
chargesum: 0.00000
title: Mulliken charges with hydrogens summed into heavy atoms:
elementType: Cl Cl Cl C C C C C C C C C C C C
charge: -0.084093 -0.084062 -0.084261 0.308126 0.310070 0.309274 0.163415 0.160484 0.164160 -0.293793 -0.293118 -0.293229 -0.094620 -0.094366 -0.093987
polarizability: 1.92310406e+02 1.83336225e-02 1.91818912e+02 -5.26889581e-02 9.48580420e-03 1.20745722e+02
1716.lowfreq: -9.2135 -3.3930 0.0007 0.0016 0.0016 6.0370 41.9146 42.6167 60.9810
frequency: 41.8616 42.5603 60.9668 70.4317 83.6746 84.7934 112.5827 127.3784 130.9702 158.7399 159.3282 168.5761 257.0428 336.7203 337.6326 367.7095 368.1915 396.5845 397.5280 434.6211 474.7534 474.9704 541.3283 541.6609 554.2969 562.0680 579.4911 631.5130 694.6825 694.9227 779.5502 795.2552 796.2195 931.8863 933.2856 933.7398 1023.5628 1024.1584 1038.3038 1040.8990 1041.5168 1052.7620 1104.5403 1104.7201 1144.0245 1145.4913 1149.3831 1241.6818 1243.9082 1245.4263 1277.7249 1324.7473 1369.2458 1398.2789 1399.2210 1401.7084 1419.6977 1419.9537 1460.7844 1460.9997 1462.6173 1463.7152 1480.3691 1480.6595 1518.3885 1519.3092 1533.9691 1581.9824 1582.8997 2974.6141 2975.0304 2975.5965 3066.9903 3067.3679 3068.2352 3087.1336 3087.9594 3089.2602 3095.1901 3096.7437 3097.6881 3161.3744 3162.3254 3162.6675
redmass: 10.4400 10.8339 17.8923 3.8737 4.1053 3.7853 1.1184 1.1564 1.1397 7.0505 7.0708 3.0850 8.4916 2.6190 2.6134 4.7421 4.9002 2.2461 2.2377 2.2491 4.9742 4.9685 6.3700 6.4180 4.4477 2.2542 6.8853 5.2828 5.7524 5.7413 4.0916 2.3140 2.3154 1.4467 1.5531 1.5514 1.8590 1.8743 1.6209 1.5373 1.5348 1.4137 2.9162 2.9046 1.2441 1.2377 1.2476 1.1947 1.1576 1.1530 4.7139 8.3491 5.2818 1.2151 1.2187 1.2188 2.6332 2.6449 1.3959 1.3965 1.0716 1.1237 1.1013 1.0971 1.0775 1.0784 1.0687 6.6154 6.5817 1.0429 1.0432 1.0434 1.0914 1.0909 1.0907 1.0614 1.0622 1.0588 1.0988 1.0954 1.0961 1.1099 1.1099 1.1099
irintensity: 0.5973 0.5670 0.1805 0.0037 2.4345 2.6056 0.0168 0.1298 0.1862 8.5688 8.4672 4.6715 0.0149 2.8636 2.7289 2.2982 2.6090 2.5874 2.6288 0.0020 27.0651 26.4857 44.1588 43.7131 1.3996 0.0224 71.5651 12.9554 15.7476 15.6275 1.0092 29.4053 29.1972 0.3481 3.2766 3.3387 12.7852 13.4709 11.7806 2.9916 2.9503 0.0083 15.2355 14.7491 2.2536 1.7491 0.3499 29.3087 30.5163 31.1472 1.6993 1.2861 0.0010 21.2738 15.2752 5.6332 20.6090 19.6634 25.9420 26.5799 2.8306 40.0289 0.0449 0.0462 7.4525 7.0906 6.5291 42.4307 42.8751 23.6648 22.8200 13.9638 7.0999 9.2737 9.1007 8.5890 7.5818 23.9853 1.6075 10.8691 10.7796 2.4468 2.6671 3.5469
temp: 298.150 k
press: 1.00000 atm
elementType: 17 17 17 6 6 6 6 6 6 6 6 6 6 6 6 1 1 1 1 1 1 1 1 1 1 1 1 1 1 1
symmnumber: 1
zpe: 624345.1 jmol-1
zpe.correction: 0.237800 hartree
zpe.thermalcorrener: 0.254867 hartree
zpe.thermalcorrenthalpy: 0.255811 hartree
zpe.thermalcorrgfe: 0.191234 hartree
zpe.sumelectzpe: -1845.343369 hartree
zpe.sumelectthermal: -1845.326303 hartree
zpe.sumelectthermalent: -1845.325358 hartree
zpe.sumelectthermalfe: -1845.389935 hartree
dipole: 0.0147 -0.0234 -5.7067
dipole: 5.7068
quadrupole: -113.7791 -113.4682 -112.0589
quadrupole: 0.0019 -0.0007 -0.0379
quadrupole: -0.6770 -0.3661 1.0432 0.0019 -0.0007 -0.0379
hfenergy: -1845.5811692 hartree
pointgroup: C01 [X(C12H15Cl3)]
dipole: -0.0056907 -0.0044184 -2.2451972 debye
polarizability: 191.8245631|0.0568205|192.3044329|0.1535554|0.046851|120.7460442 unknown
InChI: InChI=1S/C12H15Cl3/c1-7-10(4-13)8(2)12(6-15)9(3)11(7)5-14/h4-6H2,1-3H3
charge 0 multiplicity 1
30 atoms
Cl -2.036754 -3.162124 1.273848
Cl 3.747853 -0.186928 1.285041
Cl -1.697533 3.358872 1.270421
C  -0.77349 -1.194125 -0.371498
C  1.419794 -0.073181 -0.369783
C  -0.647437 1.265699 -0.371931
C  0.650797 -1.274803 -0.348829
C  -1.429556 0.07257 -0.347062
C  0.77757 1.200652 -0.348648
C  -1.5870 -2.448642 -0.46671
C  2.913526 -0.149291 -0.459339
C  -1.327084 2.597518 -0.468811
C  1.342533 -2.627318 -0.254612
C  -2.946182 0.150333 -0.245272
C  1.602351 2.476089 -0.252188
H  -1.058415 -3.280497 -0.948168
H  -2.566778 -2.302503 -0.937698
H  3.371201 0.726222 -0.935919
H  3.279947 -1.069116 -0.93132
H  -2.317581 2.553935 -0.93797
H  -0.71544 3.368704 -0.953027
H  2.292344 -2.551847 0.299488
H  0.720044 -3.357235 0.287874
H  1.56623 -3.049423 -1.254524
H  -3.261644 1.046978 0.31277
H  -3.428923 0.18402 -1.242207
H  -3.354745 -0.717547 0.297633
H  1.871492 2.873092 -1.251199
H  1.053686 3.265019 0.287582
H  2.537395 2.304875 0.305757
