program: Gaussian 09
title: 000291206
version: EM64L-G09RevD.01
frameworkgroup: C1[X(C17H14O4)]
method: RPBEPBE
basis: SDD
operation: Freq
keyword: #pfreq=noraman
keyword: PBEPBE/SDD
title: #p freq=noraman PBEPBE/SDD
converged: YES YES NO NO
title: Mulliken charges:
elementType: O O O O C C C C C C C C C C C C C C C C C H H H H H H H H H H H H H H
charge: -0.255386 -0.188838 -0.177756 -0.243833 -0.255083 0.104483 0.098886 0.335355 0.309497 -0.333958 -0.327074 -0.343149 -0.342495 -0.252000 -0.260533 -0.232572 -0.233639 -0.223599 -0.219170 0.313313 -0.756246 0.262840 0.230060 0.260972 0.275632 0.279116 0.232324 0.236176 0.234765 0.236987 0.234567 0.236906 0.251835 0.269127 0.242492
chargesum: 0.00000
title: Mulliken charges with hydrogens summed into heavy atoms:
elementType: O O O O C C C C C C C C C C C C C C C C C
charge: -0.255386 -0.188838 -0.177756 -0.243833 0.007757 0.104483 0.098886 0.335355 0.309497 -0.103898 -0.066102 -0.067518 -0.063380 -0.019676 -0.024357 0.002193 0.003347 0.010968 0.017736 0.313313 0.007208
polarizability: 2.40865040e+02 1.56201044e+00 2.00972017e+02 -2.09191046e+01 -5.66970905e+00 1.42680781e+02
1716.lowfreq: -7.9025 -5.3231 -3.0534 -0.0006 0.0007 0.0008 13.0467 21.3293 34.1613
frequency: 12.7609 21.0876 34.1404 40.0009 50.7486 63.6455 84.0525 98.7602 107.1194 143.5150 154.0762 174.3020 196.5077 236.9187 293.4407 303.1252 342.3889 394.9066 399.1321 402.6598 421.9969 442.9018 454.5643 497.2864 555.2752 563.5360 612.3817 613.0924 621.9372 656.3235 670.2054 680.3501 695.0047 697.4663 768.4385 778.7178 807.4967 831.8620 856.4087 860.9039 894.3621 933.8578 946.2481 952.6097 988.5530 989.4980 990.1863 992.0357 993.6579 1007.0165 1009.5278 1012.2122 1018.8023 1029.2155 1033.8763 1042.3963 1089.5813 1089.9277 1173.4861 1174.8560 1179.3275 1190.8866 1194.8259 1209.1411 1236.8962 1275.1642 1310.2673 1323.6952 1328.8022 1384.5928 1388.8631 1389.0000 1436.8119 1437.0218 1451.0967 1452.5186 1480.6938 1481.2542 1568.8223 1577.9739 1596.5810 1602.9152 1611.5755 1617.5055 1656.9400 2991.7226 3009.2059 3101.0308 3128.5334 3131.6213 3135.8650 3139.8150 3144.0639 3148.2532 3149.9594 3159.8422 3160.3079 3170.7532 3171.0700
redmass: 8.6305 6.2681 4.8775 4.5448 4.1332 2.2918 1.2617 7.8743 7.0355 5.5579 5.1468 5.8767 4.7730 6.7965 6.0445 7.7195 10.1767 3.8639 2.8718 2.9759 3.9742 4.0829 6.6368 5.4911 3.2845 5.8058 6.3329 6.4424 5.0941 6.6518 5.0013 6.0598 1.7509 1.6686 1.9558 2.1618 6.0267 4.7704 1.2525 1.2526 4.0462 6.3633 1.5196 1.5256 5.0673 2.9217 1.9344 2.0663 1.4137 3.2388 1.3767 1.3865 3.6430 2.0239 2.2879 1.6610 1.5942 1.6125 1.2330 1.0644 1.6364 1.1516 1.1759 2.3300 3.1804 3.1222 1.3753 1.3403 1.3243 1.2400 8.7747 8.9824 2.2771 2.2707 1.0523 1.0585 2.2300 2.1797 7.5570 6.7849 6.8162 6.9632 6.3753 7.6009 9.8784 1.0800 1.0374 1.0955 1.0854 1.0854 1.0884 1.0884 1.1021 1.0922 1.0925 1.0963 1.0961 1.1011 1.1015
irintensity: 0.3154 1.2078 1.9715 0.9221 1.1247 4.8119 0.9140 0.1746 1.7940 1.6417 0.4199 1.8116 10.0117 2.8419 2.1854 5.4224 4.0087 2.1107 0.1651 0.6189 0.7000 1.8118 5.7406 14.9491 3.3523 22.0494 0.3725 0.0480 5.6816 45.9119 5.7202 5.1762 49.5075 60.2031 53.1910 43.4716 44.3320 4.6009 2.3037 0.5589 17.7533 79.6893 13.2815 6.9148 3.1618 0.1073 6.5011 51.1301 1.9160 31.2313 0.3422 1.0366 23.1832 3.4818 16.4132 10.0399 9.2092 6.7093 45.7707 4.3746 119.9167 44.5831 5.7522 210.1411 115.7668 192.1870 21.3463 9.6150 32.6043 66.2608 1.9039 3.2763 10.7945 33.0317 15.6390 25.0285 0.7156 1.9837 134.0960 71.1917 59.6399 80.6420 13.7065 30.1450 141.1636 26.2710 0.8308 5.2818 4.6960 0.2245 6.9338 4.3356 9.0648 24.3338 11.6928 14.8105 15.9199 25.5154 19.9184
temp: 298.150 k
press: 1.00000 atm
elementType: 8 8 8 8 6 6 6 6 6 6 6 6 6 6 6 6 6 6 6 6 6 1 1 1 1 1 1 1 1 1 1 1 1 1 1
symmnumber: 1
zpe: 694591.1 jmol-1
zpe.correction: 0.264556 hartree
zpe.thermalcorrener: 0.283733 hartree
zpe.thermalcorrenthalpy: 0.284678 hartree
zpe.thermalcorrgfe: 0.212886 hartree
zpe.sumelectzpe: -955.619842 hartree
zpe.sumelectthermal: -955.600664 hartree
zpe.sumelectthermalent: -955.599720 hartree
zpe.sumelectthermalfe: -955.671511 hartree
dipole: -2.5103 -2.5438 2.0909
dipole: 4.1406
quadrupole: -94.8787 -111.7397 -129.1250
quadrupole: -5.0797 -0.3107 -6.3291
quadrupole: 17.0358 0.1748 -17.2105 -5.0797 -0.3107 -6.3291
hfenergy: -955.8843974 hartree
pointgroup: C01 [X(C17H14O4)]
dipole: 1.041945 -0.8873416 -0.8835764 debye
polarizability: 238.4773023|2.8965364|200.9828362|-25.9966381|4.0138897|145.0576997 unknown
InChI: InChI=1S/C17H14O4/c1-12(18)21-17(15(19)13-8-4-2-5-9-13)16(20)14-10-6-3-7-11-14/h2-11,17H,1H3
charge 0 multiplicity 1
35 atoms
O  0.609387 2.083586 0.427375
O  -2.00576 1.925525 1.021507
O  0.25547 -0.865383 1.73067
O  0.101896 3.006709 -1.653729
C  -0.069691 0.838111 0.01735
C  -1.564092 0.904341 0.431593
C  0.731631 -0.288135 0.714276
C  -2.447963 -0.242037 0.055605
C  2.074243 -0.641168 0.154178
C  -2.015197 -1.31141 -0.774394
C  2.618311 -0.018261 -1.003211
C  -3.785468 -0.235439 0.536632
C  2.82283 -1.654761 0.814992
C  -2.903599 -2.352613 -1.1144
C  3.882978 -0.409294 -1.490137
C  -4.669962 -1.277818 0.201397
C  4.085539 -2.041408 0.328384
C  -4.231117 -2.339771 -0.626541
C  4.618681 -1.419875 -0.827613
C  0.54024 3.151067 -0.492133
C  1.058406 4.415084 0.143214
H  -0.021264 0.756618 -1.087558
H  -0.991599 -1.343364 -1.164132
H  2.068885 0.772413 -1.524941
H  -4.101508 0.598427 1.171908
H  2.38817 -2.120696 1.705604
H  -2.564025 -3.17235 -1.756413
H  4.296358 0.073357 -2.382053
H  -5.697211 -1.267724 0.581238
H  4.655339 -2.822546 0.842849
H  -4.918865 -3.151238 -0.889526
H  5.601066 -1.720406 -1.208644
H  1.949157 4.206887 0.757459
H  0.279034 4.816679 0.815785
H  1.285502 5.161693 -0.631488
