program: Gaussian 09
title: 000291174
version: EM64L-G09RevD.01
frameworkgroup: C1[X(C15H17NO2)]
method: RPBEPBE
basis: SDD
operation: Freq
keyword: #p
keyword: freq=noraman
keyword: PBEPBE/SDD
title: #p freq=noraman PBEPBE/SDD
converged: YES YES NO NO
title: Mulliken charges:
elementType: O O N C C C C C C C C C C C C C C C H H H H H H H H H H H H H H H H H
charge: -0.288159 -0.291003 -0.461462 0.181372 0.164785 -0.042915 0.241834 0.317756 -0.806962 -0.810026 0.153679 -0.397547 -0.418481 -0.239232 -0.237406 -0.246070 -0.255005 -0.668055 0.318036 0.229256 0.231593 0.251649 0.227176 0.311655 0.229655 0.255081 0.229827 0.226676 0.225601 0.230315 0.215923 0.233609 0.212556 0.250984 0.223303
chargesum: 0.00000
title: Mulliken charges with hydrogens summed into heavy atoms:
elementType: O O N C C C C C C C C C C C C C C C
charge: -0.288159 -0.291003 -0.143426 0.181372 0.164785 -0.042915 0.241834 0.317756 -0.094463 -0.041540 0.153679 -0.142466 -0.188654 -0.012556 -0.011806 -0.015755 0.194527 0.018788
polarizability: 2.87287495e+02 6.15806415e+00 1.84197931e+02 -3.17109398e-01 -6.68742232e+00 9.91379423e+01
1716.lowfreq: -15.9850 -7.2514 -3.1466 0.0000 0.0007 0.0008 19.2304 25.5600 39.9690
frequency: 17.0944 24.5304 39.9554 58.2595 65.5478 83.9248 87.1863 130.5201 141.8307 172.7095 206.9898 223.6293 259.5925 268.2563 282.1286 298.0932 317.4739 347.0216 387.8914 408.1958 421.3590 458.8134 498.3681 561.4994 609.2295 613.8274 622.1752 636.1732 663.4529 679.0440 703.6760 726.6215 745.8512 772.2685 793.0790 815.3416 831.6414 849.6115 916.4807 973.6781 983.8245 989.1538 993.0881 997.0683 1005.4055 1033.2268 1041.5030 1042.7442 1048.1738 1049.8151 1080.6018 1095.2530 1151.9129 1159.6438 1173.0243 1192.3253 1236.5649 1271.5905 1279.1823 1312.6437 1339.4334 1359.2183 1373.6904 1385.7739 1396.9908 1404.7648 1419.3387 1431.2914 1437.5500 1454.2780 1459.7226 1462.7705 1467.7273 1476.6565 1484.5959 1485.2854 1490.9672 1531.3812 1576.1500 1590.1080 1605.3872 1617.3110 2968.5932 2983.4004 2990.3324 3027.0715 3039.4948 3065.4621 3084.7387 3089.6960 3100.9459 3114.3752 3115.4351 3115.7319 3127.7117 3140.3182 3154.8420 3167.2537 3583.6870
redmass: 1.1441 3.1248 2.8172 3.2305 5.8246 3.9927 4.5104 2.0713 2.5387 1.4613 1.6235 2.5351 4.0485 3.3729 3.5417 3.4108 3.3050 4.0497 4.7869 2.8606 4.7369 3.9644 3.5138 3.5804 4.0864 5.0182 2.2690 1.7441 5.7535 5.2580 1.8160 3.1986 8.0950 1.9477 2.7723 1.6015 3.4610 1.2502 1.4341 1.4675 2.7536 2.3214 1.3443 2.5007 3.3435 1.9101 1.6947 3.2392 1.4782 2.5128 1.6368 2.1500 1.6961 2.8959 1.0601 1.1250 6.0235 1.7898 1.1179 1.5168 2.1160 1.6866 5.3941 1.2364 1.2843 1.3046 3.1589 2.0735 2.4118 1.1156 1.0458 1.1610 1.2499 1.5383 1.0590 1.9570 1.0492 5.1571 5.4468 5.5102 8.1314 6.3585 1.0396 1.0402 1.0360 1.0586 1.0977 1.0934 1.0980 1.1031 1.0991 1.0869 1.1044 1.0966 1.0863 1.0926 1.0952 1.1008 1.0803
irintensity: 0.0127 1.3005 0.2774 1.5170 0.4780 2.1433 0.1023 3.1117 0.8505 1.2818 2.0483 0.4706 0.7232 1.2434 2.9568 0.2575 8.9911 19.0118 1.9780 0.3501 3.9584 1.5725 5.6715 5.2417 5.1103 4.1564 25.1176 60.2174 11.9790 9.9144 41.6103 13.6000 3.4648 50.5107 5.6811 0.6581 1.1461 0.2878 4.2106 0.0668 0.1412 2.0536 0.2066 23.3634 1.1200 58.4912 46.1651 278.0647 5.2861 125.0233 7.0679 16.1083 35.4442 17.7379 0.5764 0.4570 102.9682 37.6843 5.3009 7.2587 21.2824 3.8050 1.2197 29.9659 27.9157 17.8701 13.8721 134.1159 9.9145 59.4546 16.7688 11.7135 2.7285 5.1003 14.1737 20.8370 16.3540 74.1331 10.0509 105.3966 325.7523 10.2577 52.3332 22.8585 26.7782 41.7082 20.9149 20.8980 41.7580 5.4415 16.1051 11.5801 31.2568 2.7281 0.3867 23.9771 34.1688 18.2540 44.1232
temp: 298.150 k
press: 1.00000 atm
elementType: 8 8 7 6 6 6 6 6 6 6 6 6 6 6 6 6 6 6 1 1 1 1 1 1 1 1 1 1 1 1 1 1 1 1 1
symmnumber: 1
zpe: 747482.1 jmol-1
zpe.correction: 0.284701 hartree
zpe.thermalcorrener: 0.302761 hartree
zpe.thermalcorrenthalpy: 0.303706 hartree
zpe.thermalcorrgfe: 0.236059 hartree
zpe.sumelectzpe: -785.711559 hartree
zpe.sumelectthermal: -785.693498 hartree
zpe.sumelectthermalent: -785.692554 hartree
zpe.sumelectthermalfe: -785.760201 hartree
dipole: -2.0420 0.1493 0.5330
dipole: 2.1157
quadrupole: -98.3706 -94.0823 -108.7902
quadrupole: -10.8563 -0.2695 -0.7877
quadrupole: 2.0437 6.3321 -8.3759 -10.8563 -0.2695 -0.7877
hfenergy: -785.9962597 hartree
pointgroup: C01 [X(C15H17N1O2)]
dipole: -0.7996783 -0.1344416 -0.1877923 debye
polarizability: 287.6261292|-1.3953764|177.7900379|1.2241499|-22.8393076|105.2072012 unknown
InChI: InChI=1S/C15H17NO2/c1-4-18-15(17)13-10(2)14(16-11(13)3)12-8-6-5-7-9-12/h5-9,16H,4H2,1-3H3
charge 0 multiplicity 1
35 atoms
O  3.056195 1.319776 0.288835
O  3.745259 -0.898608 0.482799
N  -0.500291 -1.614339 0.247992
C  0.23236 0.532401 0.215319
C  -0.923504 -0.268588 0.170103
C  1.370298 -0.375181 0.307076
C  0.87604 -1.707081 0.319183
C  -2.356568 0.055024 0.090211
C  0.257761 2.040134 0.252962
C  1.576015 -3.034735 0.368281
C  2.802826 -0.063538 0.370435
C  -2.828761 1.148425 -0.691203
C  -3.319933 -0.743178 0.775514
C  -4.20693 1.437529 -0.773525
C  -4.698827 -0.461067 0.680099
C  -5.15137 0.634089 -0.0924
C  4.492654 1.722949 0.317757
C  5.09644 1.688325 -1.089752
H  -1.12924 -2.41312 0.170854
H  0.580443 2.468951 -0.714831
H  -0.738096 2.446362 0.498464
H  0.982138 2.397759 1.002126
H  1.349553 -3.648234 -0.525524
H  2.662256 -2.868082 0.411856
H  1.277809 -3.618654 1.260563
H  -2.113022 1.749079 -1.261123
H  -2.984754 -1.565481 1.420149
H  -4.545951 2.282548 -1.383434
H  -5.419317 -1.08587 1.220083
H  -6.221555 0.856941 -0.162793
H  4.467766 2.745014 0.730279
H  5.037029 1.047639 1.000812
H  6.133334 2.072837 -1.06362
H  5.121121 0.655732 -1.476123
H  4.511924 2.316537 -1.784223
