program: Gaussian 09
title: 000291221
version: EM64L-G09RevD.01
frameworkgroup: C1[X(C28H18O2)]
method: RPBEPBE
basis: SDD
operation: Freq
keyword: #pfreq=noraman
keyword: PBEPBE/SDD
title: #p freq=noraman PBEPBE/SDD
converged: YES YES NO NO
title: Mulliken charges:
elementType: O O C C C C C C C C C C C C C C C C C C C C C C C C C C C C H H H H H H H H H H H H H H H H H H
charge: -0.416043 -0.410713 -0.278918 -0.279237 0.327275 0.329640 0.317791 0.338210 0.173094 0.162356 0.160944 0.171294 0.036170 0.024764 -0.431360 -0.413014 -0.409364 -0.437973 -0.399341 -0.400946 -0.400930 -0.401246 -0.237885 -0.236164 -0.236263 -0.238266 -0.229819 -0.230732 -0.230771 -0.230832 0.251221 0.254971 0.262723 0.251658 0.240449 0.240136 0.239661 0.240908 0.350782 0.349690 0.229439 0.227829 0.228837 0.229586 0.227909 0.227341 0.226896 0.228242
chargesum: 0.00000
title: Mulliken charges with hydrogens summed into heavy atoms:
elementType: O O C C C C C C C C C C C C C C C C C C C C C C C C C C C C
charge: -0.065261 -0.061022 -0.278918 -0.279237 0.327275 0.329640 0.317791 0.338210 0.173094 0.162356 0.160944 0.171294 0.036170 0.024764 -0.180139 -0.158043 -0.146640 -0.186315 -0.158892 -0.160809 -0.161269 -0.160338 -0.008446 -0.008335 -0.007426 -0.008681 -0.001910 -0.003391 -0.003875 -0.002590
polarizability: 3.63348885e+02 -3.27447984e+00 3.44093128e+02 6.36260613e+01 -1.50594280e-01 2.41688980e+02
1716.lowfreq: -2.0297 -0.0005 0.0002 0.0005 2.9622 7.9260 10.7319 19.6977 23.0474
frequency: 9.1511 19.6751 22.8849 46.2502 52.6007 84.5559 93.1867 128.3451 129.4129 144.0926 151.0968 177.3759 199.1142 204.4600 209.1610 224.4177 238.3028 255.9720 305.5824 308.6513 347.3071 353.9848 365.0695 386.4425 404.4261 411.9190 424.3921 427.3766 449.1166 478.1220 495.2852 498.7979 508.7970 508.9843 569.4041 569.4599 586.3598 593.7906 609.8421 616.4345 616.5490 642.5351 643.3019 681.2425 709.6093 738.5419 742.3470 749.2971 760.4265 760.4914 761.3601 767.2581 775.2932 794.5354 795.3454 869.8363 871.3488 877.2821 880.3422 884.3507 885.1921 923.9763 925.1441 945.5127 949.8855 950.6708 953.7847 976.7663 986.0702 986.6474 988.0149 989.0849 996.2635 996.6626 1019.7571 1020.4875 1030.2812 1030.4778 1074.9386 1094.2443 1104.2887 1104.9529 1135.9735 1155.5713 1156.2727 1168.8929 1172.4745 1175.2054 1175.7021 1184.0723 1211.3173 1234.8954 1235.3249 1273.2256 1280.1771 1297.3489 1297.8946 1310.6716 1321.6422 1375.5807 1375.7601 1407.1954 1407.3188 1437.8764 1438.0779 1445.6563 1445.7270 1465.4896 1465.6812 1488.2016 1489.0952 1596.9373 1597.2425 1598.8051 1598.8942 1616.6876 1616.9639 1620.8678 1620.8985 2254.0053 3122.8136 3123.7663 3126.2258 3126.5558 3130.1280 3130.6532 3138.4463 3139.1805 3144.1791 3144.7221 3151.1195 3152.2248 3163.0890 3163.5735 3166.0855 3166.9367 3527.5026 3530.9526
redmass: 5.6512 5.5718 5.4623 5.3574 5.1462 4.4299 4.8611 4.3194 4.2317 3.6928 3.7447 4.4792 4.7188 3.3904 4.9588 1.7161 1.6394 2.1835 4.5772 4.3971 5.5828 5.0875 5.6175 5.3732 6.3401 4.7796 3.4160 3.9571 6.2561 4.5538 3.7329 4.2586 5.4856 5.4962 3.3834 3.3782 4.1808 5.1091 7.6034 7.0941 7.0804 6.6627 6.6747 6.2459 6.1366 3.2731 2.2869 3.5099 3.9931 1.4884 1.5023 1.6777 2.0124 2.5631 2.5508 3.6183 3.3555 1.4958 1.5915 1.5858 1.5832 5.1019 5.2182 1.7916 1.4390 1.4633 1.5474 4.0545 1.3381 1.3346 1.3429 1.3572 6.1630 6.1728 2.2742 2.2165 2.0256 2.0296 3.1534 2.0360 1.8246 1.8135 2.1959 1.6302 1.6311 1.2398 1.0874 1.1762 1.1708 2.0340 2.5150 1.8712 1.9039 1.5121 1.6393 1.7951 1.8012 1.7676 2.1442 8.9538 8.8601 3.4754 3.5105 2.2407 2.2360 2.7687 2.7787 2.6227 2.6204 4.3370 4.3824 7.1383 7.1777 6.7529 6.6997 7.3092 7.2635 7.4189 7.4085 11.9974 1.0864 1.0862 1.0859 1.0858 1.0890 1.0893 1.0899 1.0902 1.0942 1.0943 1.0949 1.0949 1.1002 1.1002 1.1002 1.1000 1.0660 1.0661
irintensity: 0.1249 0.0357 0.1568 0.1210 0.1771 0.5022 1.7978 0.1915 4.5733 12.3456 2.0699 1.8917 2.9320 11.4966 4.8815 112.4396 135.4962 23.8319 15.4691 4.4177 3.8492 33.5567 2.9108 1.0810 0.6503 0.6806 23.6001 1.1275 2.7591 0.6803 0.8936 2.1913 0.0173 0.0795 0.0815 0.1634 35.5889 2.4820 36.2840 5.2128 7.5924 5.4018 2.3015 1.6594 2.4708 8.3406 120.9810 4.1653 58.4144 0.9762 0.2905 54.9055 127.2989 0.2388 0.2935 18.0580 32.6259 1.5190 3.3003 0.3691 0.8936 48.6372 69.6200 1.5232 0.2381 0.7992 2.5650 0.5776 0.0164 0.0238 0.1507 0.0689 2.8015 3.4249 5.4807 0.4649 4.8649 5.3228 31.7885 0.6770 2.7834 1.9936 14.7463 16.7119 14.6533 4.6518 3.0729 5.0931 4.9735 8.6272 57.0938 0.8456 3.0046 4.9344 36.8038 3.6430 5.9313 9.9960 119.6891 3.8227 7.7836 0.4046 0.6342 29.5181 39.7384 5.7010 11.3111 5.0103 6.1737 0.1629 1.3995 0.3846 0.5287 1.1401 1.0877 6.6951 5.7961 4.1469 2.2733 0.8224 4.0532 4.1635 3.3169 2.3675 3.1194 3.3675 5.3308 5.9346 20.9199 20.0380 31.1148 26.7756 41.0713 37.1473 24.9035 21.6995 10.6466 9.1784
temp: 298.150 k
press: 1.00000 atm
elementType: 8 8 6 6 6 6 6 6 6 6 6 6 6 6 6 6 6 6 6 6 6 6 6 6 6 6 6 6 6 6 1 1 1 1 1 1 1 1 1 1 1 1 1 1 1 1 1 1
symmnumber: 1
zpe: 959176.4 jmol-1
zpe.correction: 0.365331 hartree
zpe.thermalcorrener: 0.389311 hartree
zpe.thermalcorrenthalpy: 0.390255 hartree
zpe.thermalcorrgfe: 0.309720 hartree
zpe.sumelectzpe: -1226.173057 hartree
zpe.sumelectthermal: -1226.149078 hartree
zpe.sumelectthermalent: -1226.148134 hartree
zpe.sumelectthermalfe: -1226.228668 hartree
dipole: -0.3241 1.1792 -1.2072
dipole: 1.7184
quadrupole: -154.7854 -151.9809 -170.9897
quadrupole: 3.0776 19.1710 -2.1167
quadrupole: 4.4666 7.2711 -11.7377 3.0776 19.1710 -2.1167
hfenergy: -1226.5383883 hartree
pointgroup: C01 [X(C28H18O2)]
dipole: 0.1084678 0.4706526 0.4730821 debye
polarizability: 359.8105876|4.2117257|344.2008823|66.6975111|0.0921433|245.1195227 unknown
InChI: InChI=1S/C28H18O2/c29-27(23-13-5-1-9-19(23)20-10-2-6-14-24(20)27)17-18-28(30)25-15-7-3-11-21(25)22-12-4-8-16-26(22)28/h1-16,29-30H
charge 0 multiplicity 1
48 atoms
O  -1.994754 -1.645075 1.861755
O  2.058848 -1.469133 -2.034576
C  -1.942208 -0.722362 0.685225
C  1.97838 -0.674564 -0.771291
C  -2.466593 0.683919 1.040881
C  -3.011605 -1.222798 -0.297074
C  2.529482 0.719236 -1.10618
C  2.990069 -1.174452 0.281435
C  -3.716519 0.918408 0.400465
C  -4.046678 -0.255846 -0.436158
C  3.734813 0.961019 -0.389331
C  4.026071 -0.213957 0.461213
C  -0.573446 -0.696484 0.137963
C  0.591566 -0.672984 -0.270551
C  -1.887291 1.645158 1.880899
C  -3.060397 -2.446266 -0.976249
C  2.005036 1.665466 -1.995046
C  2.991155 -2.386345 0.986091
C  -4.406448 2.128414 0.616809
C  -5.150036 -0.515775 -1.274309
C  4.430354 2.174911 -0.563687
C  5.088127 -0.476923 1.350109
C  -2.584136 2.861337 2.103055
C  -4.17172 -2.709579 -1.818192
C  2.706086 2.886073 -2.172872
C  4.062596 -2.653293 1.878005
C  -3.832522 3.096533 1.477244
C  -5.204093 -1.751108 -1.965079
C  3.905971 3.135879 -1.462552
C  5.100583 -1.706192 2.054388
H  -0.909193 1.476689 2.346515
H  -2.263951 -3.186723 -0.851408
H  1.079865 1.463166 -2.543761
H  2.179464 -3.113305 0.865156
H  -5.3677 2.325681 0.12941
H  -5.953892 0.218836 -1.394856
H  5.358579 2.378465 -0.018318
H  5.891831 0.252239 1.501342
H  -1.316118 -1.334241 2.518097
H  1.655466 -2.359765 -1.857309
H  -2.15007 3.6263 2.756017
H  -4.232939 -3.660806 -2.358096
H  2.31717 3.64119 -2.864665
H  4.084796 -3.595344 2.436722
H  -4.356863 4.041949 1.65605
H  -6.054451 -1.968817 -2.621078
H  4.434052 4.084645 -1.610571
H  5.920264 -1.925776 2.747663
