program: Gaussian 09
title: 000291167
version: EM64L-G09RevD.01
frameworkgroup: C1[X(C11H9N3O3)]
method: RPBEPBE
basis: SDD
operation: Freq
keyword: #p
keyword: freq=noraman
keyword: PBEPBE/SDD
title: #p freq=noraman PBEPBE/SDD
converged: YES YES NO NO
title: Mulliken charges:
elementType: O O O N N N C C C C C C C C C C C H H H H H H H H H
charge: -0.200911 -0.227298 -0.240670 -0.339152 -0.367171 -0.027613 -0.362494 -0.162163 0.088757 0.185852 0.344187 0.191596 -0.367409 -0.357702 -0.248514 -0.227617 -0.230680 0.297593 0.275644 0.364320 0.367211 0.274285 0.267915 0.234257 0.233518 0.234257
chargesum: 0.00000
title: Mulliken charges with hydrogens summed into heavy atoms:
elementType: O O O N N N C C C C C C C C C C C
charge: -0.200911 -0.227298 -0.240670 0.025168 0.000041 -0.027613 -0.064901 0.113481 0.088757 0.185852 0.344187 0.191596 -0.093124 -0.089787 -0.014256 0.005901 0.003577
polarizability: 1.99232751e+02 2.25585826e+01 1.35911098e+02 -3.70121697e+00 1.03957091e+01 1.06405306e+02
1716.lowfreq: -11.0729 -4.7714 -0.0005 0.0004 0.0008 7.7609 25.3788 45.9665 78.7839
frequency: 24.9776 45.9381 78.7364 95.9371 141.7875 155.1195 192.0848 260.5454 297.3498 353.2854 368.8298 402.8303 415.9559 444.7544 458.1837 498.0570 525.5614 573.6851 602.9544 615.3589 622.5389 657.6400 679.7355 697.9296 713.1982 744.6977 765.5895 776.7975 807.5915 854.6808 859.2945 879.4426 903.5768 937.0949 963.2895 978.8314 983.8748 990.1339 1002.7889 1006.6258 1039.8895 1091.2462 1141.8072 1176.6677 1201.2352 1209.2401 1229.3402 1269.5233 1283.7587 1307.5550 1331.0987 1340.4862 1371.1958 1379.6599 1394.3632 1431.7680 1435.0219 1482.4547 1513.2845 1584.7897 1612.5369 1635.6930 1681.9597 3036.4515 3069.4872 3131.9004 3143.2187 3156.2191 3165.6696 3173.5069 3526.4587 3557.2621
redmass: 8.3054 4.3134 5.9001 6.4490 5.5156 10.1048 6.0133 7.1587 8.1377 10.2850 6.2058 2.8680 5.4361 8.2146 6.4702 4.8878 4.7924 4.3515 1.8518 6.1066 3.5845 3.3032 3.2399 1.8685 7.0958 3.9973 2.1096 2.4903 6.4740 1.5141 3.6809 5.3235 5.4490 1.4325 3.1769 2.7188 1.6737 3.4193 1.3598 4.5554 2.0174 1.6292 1.8268 1.0559 1.1500 1.4411 2.3097 1.4865 1.6282 3.9331 1.3900 2.4000 1.9561 6.0137 2.8341 1.7222 2.2543 2.5562 6.0172 5.9213 5.8011 7.9899 5.2463 1.0841 1.0890 1.0854 1.0890 1.0934 1.0960 1.1010 1.0770 1.0769
irintensity: 1.1021 0.4868 0.5972 0.8135 2.0064 6.4041 3.1537 2.8724 0.9369 23.1199 6.4785 0.2391 12.7823 8.5057 12.5878 37.7794 13.1376 1.4135 87.6643 1.6750 46.5769 36.1135 2.6050 53.7924 46.0818 26.8510 162.7915 87.7202 11.3925 14.0222 19.8368 3.9167 2.3852 7.8771 0.3736 1.8178 1.0391 0.4739 0.7814 18.4965 4.2975 6.0327 40.2844 0.0210 17.1112 43.5146 59.5128 8.9633 36.6844 81.9308 3.9598 160.6490 3.5089 0.9855 131.3585 19.7840 24.2111 10.4986 2.4020 3.0195 0.9558 219.8311 595.8530 1.2474 21.2456 0.0217 13.1544 13.2154 6.9908 21.2182 68.0006 70.1655
temp: 298.150 k
press: 1.00000 atm
elementType: 8 8 8 7 7 7 6 6 6 6 6 6 6 6 6 6 6 1 1 1 1 1 1 1 1 1
symmnumber: 1
zpe: 499333.4 jmol-1
zpe.correction: 0.190186 hartree
zpe.thermalcorrener: 0.203514 hartree
zpe.thermalcorrenthalpy: 0.204458 hartree
zpe.thermalcorrgfe: 0.148815 hartree
zpe.sumelectzpe: -813.285315 hartree
zpe.sumelectthermal: -813.271987 hartree
zpe.sumelectthermalent: -813.271043 hartree
zpe.sumelectthermalfe: -813.326686 hartree
dipole: -0.9503 -0.4332 -1.9684
dipole: 2.2283
quadrupole: -89.5250 -106.7457 -99.0881
quadrupole: 4.5350 -13.6300 0.9386
quadrupole: 8.9279 -8.2928 -0.6352 4.5350 -13.6300 0.9386
hfenergy: -813.4755012 hartree
pointgroup: C01 [X(C11H9N3O3)]
dipole: -0.3577182 -0.2449196 -0.761967 debye
dipolederiv: -1.1773313 -0.4714842 0.0646915 0.2484638 -0.2183124 0.0912932 0.3147492 0.2263468 -0.3377717 -0.658976 -0.1278868 -0.1729105 -0.192473 -0.8978225 -0.2564031 -0.23391 -0.1085916 -0.5002307 -0.850716 0.000652 -0.421073 -0.0024543 -0.514656 0.0586914 -0.5968213 0.1135717 -0.899118 -0.6880418 0.0980017 -0.0619348 0.3614664 -0.659729 0.2793746 -0.3047572 0.3843388 -0.8273737 -0.9570455 -0.3813441 -0.3955856 -0.2409484 -0.6019195 -0.1449965 -0.5825896 -0.2575946 -0.6876946 0.4261959 0.5161841 -0.1354083 0.132103 -0.1629488 0.060708 -0.1810106 -0.2096754 -0.0934675 -0.3007886 0.0851461 0.0294509 0.1239329 -0.354744 0.0521428 0.0139122 0.0303215 0.0823635 0.8519021 -0.1229386 0.1776003 -0.4693008 0.1524317 -0.0768999 0.2469629 -0.1685595 0.7054141 0.7773128 -0.0575169 -0.138707 -0.2029687 0.1337267 0.0129021 -0.2693222 0.132663 0.0216334 0.9382739 0.2291855 0.5808787 -0.0257862 1.1003292 0.1129497 0.8519907 0.1121183 0.8065016 -0.1054466 -0.0326227 0.0322275 0.131546 -0.0157493 -0.0212903 -0.0254687 -0.0147921 0.0132477 1.0815807 0.3071097 0.5900106 0.2692884 1.3152449 -0.2519907 0.8952526 -0.3267519 1.2812315 -0.0304749 -0.0419688 -0.0798757 0.0756745 -0.0414908 0.0198103 -0.0350045 0.0234368 -0.1001688 -0.0395677 0.0973945 0.0086594 -0.0460863 -0.0013499 0.0835281 -0.0233208 0.0219007 -0.0844065 -0.127877 0.0945839 0.032239 0.1336624 0.1001695 0.0937373 0.0776816 0.0966428 -0.1149514 -0.049385 -0.0989476 -0.1101673 -0.1206127 -0.0687798 0.1069679 -0.118609 0.0938543 -0.0305728 0.040417 0.0597504 -0.065747 0.0523067 -0.0237244 0.0352222 -0.0582296 0.0460061 -0.0880779 0.0864223 -0.0045458 -0.0408045 -0.0225086 0.0602109 -0.0287568 -0.0379461 -0.0234243 0.0045337 -0.0527984 0.0094089 0.0369469 0.0711145 0.0691899 0.0409847 0.0341601 0.0429351 -0.0855872 0.348102 0.0116342 -0.0824041 -0.0338427 0.2295551 0.0442767 -0.1188363 0.0536986 0.2003878 0.2580381 -0.0315666 -0.0790359 -0.0927084 0.2133903 -0.0166007 -0.08684 -0.0102283 0.2386535 0.149013 0.0247533 0.0797708 -0.0023521 0.0832767 -0.0459647 0.0830379 -0.0309532 0.0907923 0.098 -0.0680432 -0.0111124 -0.0366421 0.0204288 -0.0675649 -0.0157107 -0.0438325 0.1207096 0.064081 -0.0596631 0.0049499 -0.0918492 -0.0495374 -0.083138 -0.0051209 -0.0883619 0.1051207 0.0050934 0.0414179 0.0906636 0.0601942 0.0482019 -0.0919911 0.1042436 -0.0899988 0.0558846 -0.0859833 -0.076694 0.0666768 -0.0792192 0.0846082 -0.0069924 0.0715066 -0.0050704 0.1229468 unknown
polarizability: 195.4097141|26.8277184|140.8513792|-5.8931189|8.0737129|105.2880623 unknown
InChI: InChI=1S/C11H9N3O3/c15-9-7-8(6-4-2-1-3-5-6)14-17-10(7)13-11(16)12-9/h1-5,7,10,12-13H
charge 0 multiplicity 1
26 atoms
O  1.223715 2.384288 -0.964367
O  0.603981 -2.412182 -0.946219
O  3.671639 -0.280955 1.821968
N  2.859162 0.867429 -0.044063
N  2.041468 -1.28679 0.483498
N  -0.112813 2.0923 -0.468503
C  0.821491 0.016555 -1.235308
C  1.953206 1.066553 -1.16453
C  -0.359888 0.795536 -0.587921
C  1.139026 -1.333135 -0.57824
C  -1.678079 0.25376 -0.206417
C  2.901577 -0.207968 0.830467
C  -2.147067 -0.9923 -0.707584
C  -2.521502 1.018535 0.652404
C  -3.434301 -1.455206 -0.358928
C  -3.802609 0.548803 0.994327
C  -4.266037 -0.691405 0.490043
H  0.562106 -0.202182 -2.286631
H  2.50406 1.207824 -2.108105
H  3.491634 1.636844 0.185911
H  2.185187 -2.147645 1.02106
H  -1.514283 -1.602929 -1.358203
H  -2.156717 1.975098 1.039211
H  -3.784476 -2.415879 -0.751316
H  -4.44012 1.14429 1.656702
H  -5.262558 -1.057738 0.760046
