program: Gaussian 09
title: 000291187
version: EM64L-G09RevD.01
frameworkgroup: C1[X(C19H14N2O2S)]
method: RPBEPBE
basis: SDD
operation: Freq
keyword: #p
keyword: freq=noraman
keyword: PBEPBE/SDD
title: #p freq=noraman PBEPBE/SDD
converged: YES YES NO NO
title: Mulliken charges:
elementType: S O O N N C C C C C C C C C C C C C C C C C C C H H H H H H H H H H H H H H
charge: 0.938270 -0.507440 -0.534205 -0.529730 -0.085886 -0.184894 0.079235 0.359131 0.411414 0.449572 0.377697 -0.573269 -0.245514 -0.326581 -0.418815 -0.396085 -0.228648 -0.419683 -0.305892 -0.408693 -0.242478 -0.240260 -0.168610 -0.354019 0.322876 0.237626 0.300821 0.279122 0.239658 0.244733 0.247730 0.236511 0.253778 0.241426 0.227934 0.228830 0.240485 0.253851
chargesum: 0.00000
title: Mulliken charges with hydrogens summed into heavy atoms:
elementType: S O O N N C C C C C C C C C C C C C C C C C C C
charge: 0.938270 -0.507440 -0.534205 -0.206854 -0.085886 -0.184894 0.079235 0.359131 0.411414 0.449572 0.377697 -0.335643 0.055308 -0.047459 -0.179156 -0.151353 0.019082 -0.183173 -0.052113 -0.167267 -0.014544 -0.011431 0.071875 -0.100167
polarizability: 3.31806787e+02 2.11377962e+01 2.80778475e+02 2.04151019e+01 -1.95624401e+01 2.15455117e+02
1716.lowfreq: -7.5525 -5.0696 -4.0542 -0.0019 -0.0012 -0.0011 12.4356 22.3854 35.7346
frequency: 12.1033 22.2935 35.7307 66.5886 83.5277 107.9688 118.9717 161.1546 175.5888 180.9210 189.1535 201.1239 207.6901 227.3167 267.6970 308.6469 344.1936 372.2281 403.4289 414.5794 420.5586 425.1722 459.2038 468.8000 474.3076 488.7376 515.6761 520.2265 534.2350 546.3750 555.1268 620.0501 629.8072 633.2827 657.2232 719.3899 757.7622 758.6909 773.2205 779.1129 782.2070 799.9255 804.7343 815.1397 825.8427 847.4003 866.0829 891.4080 899.7428 918.2646 929.5459 934.7843 951.1254 953.4356 955.4522 960.4984 978.2582 988.9101 990.0815 999.0565 1022.9326 1029.9442 1058.7700 1123.4997 1124.0559 1157.6996 1158.8110 1171.9951 1187.5967 1193.6321 1222.5017 1237.9853 1242.3437 1264.6759 1274.6856 1299.2480 1344.3501 1364.8402 1372.6693 1393.2146 1411.6225 1429.9282 1432.4547 1440.1443 1443.4589 1457.9176 1489.4981 1515.1488 1545.2665 1574.0996 1587.2923 1598.0088 1622.3316 1630.5084 3118.6322 3120.2434 3125.0355 3132.3309 3133.3554 3135.9185 3140.4773 3142.3424 3149.7143 3161.9026 3169.5689 3175.9798 3183.0764 3274.8214
redmass: 6.1368 5.0402 5.1456 5.9461 6.7900 6.5481 6.5375 6.6124 10.3720 4.5074 3.7681 7.0919 6.1993 9.5703 6.4251 4.2580 5.5768 7.8142 3.4240 4.4035 5.0301 5.4787 5.8530 3.3912 3.0226 4.1169 5.7665 7.1850 6.2512 4.6265 4.2222 6.4375 6.2908 3.6337 2.7619 5.6038 4.5469 1.3818 1.3035 2.5748 5.5956 2.1514 6.3653 7.8763 1.3464 2.0320 1.5131 4.0674 1.8011 1.7085 5.8118 1.3629 3.9467 1.5208 2.2688 2.0264 1.4111 1.3697 1.3539 1.3936 2.2607 2.7244 2.0679 1.7445 1.8302 1.2340 1.2484 1.0874 1.5359 1.5323 1.9593 2.1041 1.7513 1.8751 1.7976 1.5804 5.0624 2.1174 1.4954 2.0222 5.7312 4.5410 3.4534 2.4850 2.6848 2.1936 3.8398 3.4581 7.2825 6.7706 5.6260 5.7104 7.3778 6.6620 1.0881 1.0889 1.0889 1.0901 1.0889 1.0885 1.0925 1.0947 1.0911 1.1003 1.0985 1.0990 1.0956 1.0755
irintensity: 1.4174 0.3476 0.2897 0.1904 2.4207 3.9161 1.6399 1.8228 16.2525 4.4913 2.9463 10.7550 2.4000 2.2431 2.3012 5.7489 27.9071 17.6339 1.1326 19.4331 15.2066 26.1734 44.3683 20.3267 18.8171 2.1252 4.0933 4.8582 2.9991 18.7569 5.4946 2.8908 3.7373 1.3573 1.9023 6.4206 1.7864 48.9127 6.8973 0.6263 5.6632 59.7523 21.9171 65.0678 39.7658 50.7493 46.6910 5.3783 11.1357 150.6806 14.4148 0.1645 15.6012 4.1577 21.9513 17.3562 3.7751 0.1295 0.2018 1.9115 4.3884 1.8112 5.7942 5.5539 4.3558 3.3734 2.7805 0.7911 5.1262 2.7528 15.4502 6.4730 3.3564 28.1142 6.8947 7.3245 14.9476 13.6952 15.2125 3.0830 3.2834 4.3377 1.7531 3.9877 0.6856 1.5235 39.1376 15.8859 5.5091 0.5693 6.9833 7.6834 5.4032 0.0774 0.2429 15.1105 0.2725 9.7904 3.2176 5.4337 11.8770 32.2995 5.3295 43.4748 19.6291 20.3142 1.5947 43.2183
temp: 298.150 k
press: 1.00000 atm
elementType: 16 8 8 7 7 6 6 6 6 6 6 6 6 6 6 6 6 6 6 6 6 6 6 6 1 1 1 1 1 1 1 1 1 1 1 1 1 1
symmnumber: 1
zpe: 737595.2 jmol-1
zpe.correction: 0.280935 hartree
zpe.thermalcorrener: 0.300725 hartree
zpe.thermalcorrenthalpy: 0.301669 hartree
zpe.thermalcorrgfe: 0.230697 hartree
zpe.sumelectzpe: -1388.628463 hartree
zpe.sumelectthermal: -1388.608673 hartree
zpe.sumelectthermalent: -1388.607729 hartree
zpe.sumelectthermalfe: -1388.678700 hartree
dipole: -0.4331 8.9323 2.9030
dipole: 9.4022
quadrupole: -134.5617 -145.8107 -138.4066
quadrupole: -21.4906 -4.6073 -9.8497
quadrupole: 5.0313 -6.2177 1.1864 -21.4906 -4.6073 -9.8497
hfenergy: -1388.9093977 hartree
pointgroup: C01 [X(C19H14N2O2S1)]
dipole: 0.1194186 3.5919465 -0.8758441 debye
polarizability: 334.0113384|-20.6106108|277.7810003|6.6737714|26.6270614|216.2480398 unknown
InChI: InChI=1S/C19H14N2O2S/c22-24(23,18-9-3-7-15-8-4-12-20-19(15)18)21-17-11-10-14-5-1-2-6-16(14)13-17/h1-13,21H
charge 0 multiplicity 1
38 atoms
S  1.457058 -2.320489 0.027802
O  2.736832 -2.900444 0.829082
O  0.687936 -3.242508 -1.071368
N  0.17146 -1.763605 1.396731
N  2.301929 0.433207 1.187962
C  1.965227 -0.73915 -0.925405
C  2.391301 0.411618 -0.197978
C  -1.065375 -1.271027 0.904538
C  -2.762458 0.515071 0.736497
C  2.886719 1.536859 -0.967659
C  -3.664728 -0.410563 0.07879
C  -1.458297 0.065782 1.112254
C  1.957416 -0.802809 -2.312029
C  -1.966163 -2.190014 0.254709
C  -3.223914 -1.759039 -0.152186
C  2.896241 1.46246 -2.39839
C  2.428006 0.324411 -3.058132
C  -3.199337 1.86258 0.970217
C  3.343831 2.681245 -0.236482
C  -4.963251 0.045834 -0.315595
C  -4.471371 2.279897 0.571116
C  -5.36191 1.364662 -0.076102
C  3.285941 2.67683 1.158084
C  2.744154 1.533335 1.827603
H  0.749664 -1.041023 1.880225
H  -0.764999 0.770514 1.589762
H  1.593763 -1.709145 -2.808269
H  -1.638096 -3.221149 0.100443
H  -3.906518 -2.460156 -0.646478
H  3.273034 2.317896 -2.97121
H  2.427708 0.279119 -4.151579
H  -2.518032 2.562613 1.468918
H  3.732832 3.548642 -0.781819
H  -5.644393 -0.657087 -0.810058
H  -4.79559 3.31029 0.754145
H  -6.357759 1.703725 -0.381773
H  3.632586 3.531318 1.74615
H  2.665551 1.521699 2.920587
