program: Gaussian 09
title: 000291153
version: EM64L-G09RevD.01
frameworkgroup: C1[X(C10H8O3)]
method: RPBEPBE
basis: SDD
operation: Freq
keyword: #pfreq=noraman
keyword: PBEPBE/SDD
title: #p freq=noraman PBEPBE/SDD
converged: NO YES NO NO
title: Mulliken charges:
elementType: O O O C C C C C C C C C C H H H H H H H H
charge: -0.232536 -0.278930 -0.221395 0.291002 0.181261 -0.425912 0.224399 -0.398923 -0.339686 -0.231522 -0.207811 0.151956 -0.496802 0.289688 0.249217 0.261266 0.229861 0.233669 0.243936 0.233327 0.243936
chargesum: 0.00000
title: Mulliken charges with hydrogens summed into heavy atoms:
elementType: O O O C C C C C C C C C C
charge: -0.232536 -0.278930 -0.221395 0.291002 0.181261 -0.136224 0.224399 -0.149706 -0.078420 -0.001661 0.025858 0.151956 0.224396
polarizability: 2.06098273e+02 3.53568334e+00 1.15543168e+02 8.66227945e-03 -2.54180470e-03 5.09664547e+01
1716.lowfreq: -5.6716 -2.8149 -0.0012 -0.0009 -0.0008 2.8578 57.4324 74.0375 107.5653
frequency: 57.3645 73.9768 107.5641 108.7482 156.2275 249.2577 262.9298 282.1691 318.5961 360.0774 430.1130 516.8040 560.4874 567.5378 580.3293 603.9298 715.3419 721.8592 751.3834 757.8482 785.5318 854.4549 864.7353 879.8503 890.1401 930.0650 947.3898 983.5374 1005.2919 1058.3088 1101.9909 1114.4176 1145.1472 1156.8928 1161.4437 1182.6125 1257.8748 1271.0612 1312.4164 1412.2374 1423.7727 1432.1594 1453.0313 1464.5884 1467.7909 1540.5185 1592.1754 1622.8653 1651.6033 3001.3448 3101.4003 3136.9028 3147.0860 3150.1057 3165.7971 3179.8394 3240.7519
redmass: 4.9577 3.6261 4.6752 1.2230 3.8370 4.3181 5.1908 6.2070 4.8878 7.2008 3.0419 6.1075 4.4546 6.8782 4.3811 6.9642 7.0380 6.0836 4.2278 1.2583 5.0637 1.3164 5.6004 1.5082 7.4121 8.5269 1.3832 1.3134 2.1032 4.5212 2.0263 1.2613 1.5158 1.4300 1.3855 1.9512 2.3353 4.8456 2.1262 3.7533 1.3537 2.5814 1.0493 1.0543 3.0114 6.9205 7.0083 7.8134 10.6731 1.0299 1.1045 1.0859 1.1043 1.0910 1.0969 1.0986 1.0987
irintensity: 1.4323 1.5373 1.7923 0.0807 2.8333 2.9996 12.4790 4.6165 5.0729 3.6845 12.0420 3.8031 0.0622 2.8071 0.0170 2.4688 14.0509 7.9961 4.6221 89.6519 3.3734 13.0339 8.8017 23.3268 3.3847 13.7970 6.5490 0.0009 5.8008 228.4034 6.9816 0.0630 182.8369 92.3189 18.0440 24.6311 11.4214 113.2409 1.5201 13.9446 14.4704 14.8860 14.2865 14.8312 8.1840 81.7665 0.3297 9.0927 334.1033 42.7115 26.7573 1.4091 15.3467 10.1645 21.6667 10.9369 1.1919
temp: 298.150 k
press: 1.00000 atm
elementType: 8 8 8 6 6 6 6 6 6 6 6 6 6 1 1 1 1 1 1 1 1
symmnumber: 1
zpe: 408343.4 jmol-1
zpe.correction: 0.155530 hartree
zpe.thermalcorrener: 0.166499 hartree
zpe.thermalcorrenthalpy: 0.167444 hartree
zpe.thermalcorrgfe: 0.118022 hartree
zpe.sumelectzpe: -610.604459 hartree
zpe.sumelectthermal: -610.593490 hartree
zpe.sumelectthermalent: -610.592546 hartree
zpe.sumelectthermalfe: -610.641967 hartree
dipole: -1.0941 -2.9910 0.0003
dipole: 3.1848
quadrupole: -55.1019 -73.8004 -77.3701
quadrupole: -8.0566 0.0025 0.0001
quadrupole: 13.6556 -5.0430 -8.6126 -8.0566 0.0025 0.0001
hfenergy: -610.759989 hartree
pointgroup: C01 [X(C10H8O3)]
dipole: 0.4462992 1.1708217 0.000099 debye
dipolederiv: -0.5505914 0.1356649 0.0000103 -0.1494713 -0.484761 0.0000039 -0.0000362 -0.0000177 -0.1263458 -1.4609488 0.3044736 0.0001826 0.8312217 -0.7812631 -0.0001526 0.0003621 -0.0001621 -0.2995782 -0.8842536 -0.2712717 -0.000022 -0.2322913 -0.8832232 -0.0001378 0.0000786 0.0000047 -0.3120987 -0.1558817 0.0709083 0.0000124 -0.0129917 -0.1664658 -0.0000018 -0.0000006 -0.0000016 0.0272281 0.3486089 0.0292049 0.0000015 0.1663594 0.0764601 -0.0000046 -0.0000162 -0.0000081 0.066725 0.3604351 -0.1270062 -0.0000244 0.1634468 -0.0285895 -0.0000028 -0.0000298 0.000008 -0.1623274 -0.9061354 -0.2506439 0.0000599 -0.5840375 0.3572727 0.0000131 0.0000298 0.0000114 0.0437828 0.2094394 -0.0353445 -0.0000148 0.094459 0.1378615 -0.000001 -0.0000041 0.0000061 -0.1575964 -0.0383386 -0.067184 -0.0000055 -0.0663678 0.0597703 0.0000103 0.0000068 0.0000083 -0.16042 -0.0573642 0.1144527 0.0000006 0.3109385 -0.0554152 -0.0000111 0.000003 -0.0000021 -0.1670641 -0.0724459 -0.0274164 0.0000003 -0.1713235 0.0906421 0.000011 -0.0000041 0.0000072 -0.1622977 2.3668194 0.1197124 -0.0001523 -0.3069178 1.3836265 0.0002865 -0.0003095 0.000171 0.2577547 0.8198939 -0.1195807 -0.0000985 -0.0757347 0.2359156 -0.0000045 -0.0001055 0. 0.2808723 0.0956328 0.0321021 0.0000019 0.0708538 0.0525862 -0.0000062 0.0000015 -0.0000074 0.1831104 0.0843623 0.0194355 0.0000027 -0.0249814 -0.082655 -0.0000031 0.0000012 -0.0000053 0.1658409 0.0934676 -0.0177753 0.0000019 0.0223641 -0.0366557 -0.0000052 0.0000016 -0.0000041 0.1837551 -0.0908292 -0.0905011 0.0000066 -0.0912536 0.0393916 0.0000006 0.0000062 0.0000008 0.1658083 -0.0737188 0.0875898 0.0000091 0.0824669 0.0442681 -0.0000047 0.0000059 -0.0000054 0.1633693 -0.0524533 0.0223176 -0.0213849 -0.0752174 0.0619254 -0.0989323 -0.0678217 -0.0669592 -0.05637 0.0167329 0.0485235 0.0000215 0.1236699 -0.0825745 -0.000036 0.0000314 -0.0000293 0.122216 -0.0524314 0.0223386 0.0213909 -0.0751922 0.0618828 0.0989783 0.0677998 0.0669848 -0.0563646 unknown
polarizability: 206.1771648|2.3131839|115.4642768|-0.0086272|0.0026584|50.9664547 unknown
InChI: InChI=1S/C10H8O3/c1-12-10(11)9-6-7-4-2-3-5-8(7)13-9/h2-6H,1H3
charge 0 multiplicity 1
21 atoms
O  -0.091611 -1.188227 0.000161
O  -3.121482 0.858428 0.000582
O  -2.939884 -1.479857 0.000222
C  1.162435 0.771161 0.000159
C  1.210313 -0.657665 0.00013
C  -0.240624 1.125455 0.00021
C  -0.959352 -0.061543 0.000206
C  2.38241 1.49854 0.000137
C  2.399721 -1.401168 0.000085
C  3.589149 0.772446 0.00009
C  3.598446 -0.655185 0.000064
C  -2.400778 -0.349527 0.000208
C  -4.593421 0.701466 0.000782
H  -0.680246 2.120056 0.000246
H  2.385383 2.59329 0.000157
H  2.392298 -2.494338 0.000066
H  4.54414 1.308624 0.000072
H  4.557412 -1.184234 0.000027
H  -4.921364 0.15148 -0.897874
H  -4.98535 1.728212 0.000954
H  -4.921096 0.151288 0.899419
