program: Gaussian 09
title: 000291248
version: EM64L-G09RevD.01
frameworkgroup: C1[X(C19H21NO3S2)]
method: RPBEPBE
basis: SDD
operation: Freq
keyword: #p
keyword: freq=noraman
keyword: PBEPBE/SDD
title: #p freq=noraman PBEPBE/SDD
converged: NO YES NO NO
title: Mulliken charges:
elementType: S S O O O N C C C C C C C C C C C C C C C C C C C H H H H H H H H H H H H H H H H H H H H H
charge: 0.214541 0.186423 -0.427789 -0.212639 -0.279563 -0.313233 -0.187232 -0.725633 -0.825320 0.258914 -0.831200 0.488591 0.258398 0.493470 -0.380603 -0.373207 -0.774083 -0.390028 -0.377652 -0.220299 -0.219005 -0.235129 -0.221864 -0.218659 -0.239100 0.311980 0.301666 0.327126 0.295118 0.292607 0.310640 0.259153 0.234670 0.247810 0.233505 0.251442 0.257277 0.220847 0.256977 0.388407 0.227694 0.229283 0.230625 0.224303 0.223819 0.226951
chargesum: 0.00000
title: Mulliken charges with hydrogens summed into heavy atoms:
elementType: S S O O O N C C C C C C C C C C C C C C C C C C C
charge: 0.214541 0.186423 -0.039382 -0.212639 -0.279563 0.013894 -0.187232 -0.111986 -0.237595 0.258914 -0.261407 0.488591 0.258398 0.493470 -0.145933 -0.125398 -0.038982 -0.156523 -0.126210 0.007395 0.010278 -0.004504 0.002439 0.005160 -0.012148
polarizability: 3.38296602e+02 7.56050193e-01 2.83545897e+02 1.69551329e+01 -6.29346946e+00 1.86289128e+02
1716.lowfreq: -14.7238 -7.2142 -0.0016 -0.0007 0.0017 2.3744 6.8086 7.3156 23.3223
frequency: -14.2703 6.8779 23.2064 25.2228 33.7823 37.3634 44.9607 65.5619 74.9530 76.3252 86.4290 90.3346 96.5632 117.6510 125.0167 144.1961 181.4010 193.9209 220.2746 234.6384 280.5006 309.0795 327.6531 337.2538 338.6106 350.6243 362.9557 402.1841 403.7710 470.0020 473.9749 490.2719 503.0075 553.5263 555.2744 570.4837 573.5949 585.5007 616.3728 616.3912 621.4332 642.6650 646.5277 655.0043 696.9311 701.6521 703.9732 738.6838 775.4294 776.9604 804.2465 807.3529 819.0202 853.5945 854.5348 884.1542 901.3085 909.5652 915.7350 928.3247 929.0268 978.7969 978.8952 988.0491 989.6850 989.9873 995.6047 997.8502 1025.3651 1026.1002 1026.4649 1040.6177 1063.6011 1072.5631 1074.9612 1131.9112 1136.5329 1154.3447 1171.5427 1173.3269 1186.3074 1187.7468 1219.5708 1222.0217 1229.0918 1237.4713 1247.1945 1282.5899 1291.8752 1293.7452 1326.4619 1326.6005 1384.8440 1385.1314 1385.6318 1429.4893 1440.4992 1440.7749 1446.3875 1466.1556 1469.4307 1476.5013 1482.5717 1483.3524 1494.6442 1592.7954 1593.3791 1612.4112 1612.9129 1629.9304 1648.8746 2996.0933 3025.9527 3030.3302 3050.4551 3087.4811 3107.0400 3113.5445 3118.0911 3122.5159 3122.6337 3122.8955 3125.1887 3126.4000 3134.8070 3138.0196 3145.5761 3149.5675 3161.9905 3165.7117 3513.9644 3530.3966
redmass: 5.2516 5.7370 4.0445 3.8704 4.9421 6.4028 4.8769 3.8464 6.3395 2.5553 1.4417 5.5589 6.0678 8.0197 7.1019 9.9108 6.7436 5.7437 5.5071 5.3320 5.6170 7.7153 3.9932 2.3920 2.4073 2.7442 4.3156 2.8048 2.8199 4.1243 3.9148 4.9846 3.9461 5.7380 4.5191 3.2506 1.7611 1.5263 6.3112 6.3359 3.1013 4.2326 3.6425 3.2941 4.3853 1.6854 1.7112 5.7153 2.1092 2.1398 4.7072 4.0191 4.8428 1.2483 1.2477 1.8416 4.0927 1.6654 1.5254 1.4515 1.4857 1.3894 1.3873 1.9961 6.1078 6.0029 1.3189 1.3261 2.3747 2.2001 2.3310 1.6728 2.2804 1.5353 1.5407 1.0889 1.1314 2.2509 1.0522 1.0527 1.1133 1.1116 2.4512 1.8664 1.7999 1.2874 1.4896 2.7875 1.5953 1.5550 1.2705 1.2735 5.8116 1.3080 8.5399 1.1138 2.1148 2.1795 1.0805 1.1319 1.0926 1.1560 2.3323 2.1356 1.5940 6.0704 6.0573 6.1012 6.1053 5.2958 9.2457 1.0371 1.0569 1.0566 1.0573 1.0987 1.1092 1.1096 1.0853 1.0857 1.0877 1.0990 1.1057 1.0877 1.0922 1.0922 1.0966 1.0965 1.1017 1.1017 1.0641 1.0763
irintensity: 0.6895 0.2837 1.7672 0.3850 4.4970 0.1787 0.6454 4.5740 2.2280 0.1606 0.5077 2.6626 0.2990 3.6786 1.7043 3.3020 2.2858 8.7320 0.7100 0.5964 2.0001 0.6923 6.7113 1.3210 1.6968 8.2835 0.0982 0.0053 0.0488 5.4954 12.3640 1.6365 31.7377 20.4105 7.4390 2.9553 54.7021 43.3314 0.1812 0.1330 98.8846 73.3836 41.7554 62.0357 7.7993 54.3029 58.2090 10.8611 23.0995 28.1813 1.1479 7.0576 7.5019 0.0443 0.0996 26.8842 16.5397 3.7692 5.3647 0.9830 6.7110 0.0680 0.1268 18.1651 0.0339 0.3447 0.2443 0.0273 65.4510 7.2351 23.9517 33.6912 97.6512 8.8771 21.4564 0.8101 4.6666 0.6102 0.0196 0.0021 2.0701 2.0410 4.6318 0.6606 6.7593 9.3589 21.8964 121.3777 17.3504 27.3274 0.3024 0.7735 7.3383 56.3247 0.0714 53.2347 14.4285 9.9544 59.4619 11.5499 27.7552 5.6622 23.5751 15.1901 335.9879 0.9744 0.4182 2.1021 5.2939 220.4834 276.9441 7.5186 26.0373 10.4001 12.5276 15.8845 2.2680 0.3638 5.6587 5.2982 0.2387 9.1610 0.4260 0.6150 16.8180 14.7144 39.1325 35.6628 27.6697 26.3505 33.1558 24.0084
temp: 298.150 k
press: 1.00000 atm
elementType: 16 16 8 8 8 7 6 6 6 6 6 6 6 6 6 6 6 6 6 6 6 6 6 6 6 1 1 1 1 1 1 1 1 1 1 1 1 1 1 1 1 1 1 1 1 1
symmnumber: 1
zpe: 940247.4 jmol-1
zpe.correction: 0.358121 hartree
zpe.thermalcorrener: 0.383232 hartree
zpe.thermalcorrenthalpy: 0.384177 hartree
zpe.thermalcorrgfe: 0.297864 hartree
zpe.sumelectzpe: -1811.349006 hartree
zpe.sumelectthermal: -1811.323895 hartree
zpe.sumelectthermalent: -1811.322951 hartree
zpe.sumelectthermalfe: -1811.409263 hartree
dipole: -2.2119 -0.5826 -0.3887
dipole: 2.3201
quadrupole: -150.2047 -157.7440 -151.0090
quadrupole: -2.5831 10.5428 0.4520
quadrupole: 2.7812 -4.7581 1.9769 -2.5831 10.5428 0.4520
hfenergy: -1811.7071272 hartree
pointgroup: C01 [X(C19H21N1O3S2)]
dipole: -0.8310863 0.3415636 0.1607622 debye
polarizability: 336.2842047|-8.3855992|284.1027729|-21.1011214|-7.7833556|187.7446499 unknown
InChI: InChI=1S/C19H21NO3S2/c1-15(21)20-19(18(22)23,25-13-17-10-6-3-7-11-17)14-24-12-16-8-4-2-5-9-16/h2-11,20,22H,12-14H2,1H3
charge 0 multiplicity 1
46 atoms
S  -2.008291 -0.491493 -0.623719
S  1.127731 0.239731 0.410285
O  -2.340643 -2.191992 2.181276
O  -2.243387 -3.845717 0.552884
O  1.925682 -2.978719 0.053765
N  -0.218565 -2.523948 -0.812587
C  -0.852733 -1.800431 0.284404
C  0.102915 -1.105068 1.263637
C  -2.49385 0.7241 0.784965
C  -1.857292 -2.739021 0.98235
C  2.802084 -0.105508 1.298303
C  -3.444542 1.744533 0.205834
C  1.069584 -3.049259 -0.877229
C  3.915706 0.610103 0.575192
C  -4.847634 1.536236 0.249683
C  -2.943406 2.92777 -0.397331
C  1.395657 -3.709737 -2.215018
C  4.296658 1.927242 0.940445
C  4.598353 -0.028984 -0.493405
C  -5.733237 2.495633 -0.288688
C  -3.827829 3.88739 -0.937421
C  -5.225282 3.674407 -0.883571
C  5.33852 2.592686 0.255848
C  5.641165 0.633309 -1.17737
C  6.013976 1.94695 -0.805588
H  0.814049 -1.843173 1.666512
H  -0.482908 -0.664483 2.081864
H  -0.850428 -2.783227 -1.574053
H  -2.949776 0.121569 1.585427
H  -1.55622 1.187992 1.130798
H  2.920439 -1.199859 1.253954
H  2.699091 0.235661 2.341179
H  -5.242544 0.620324 0.705687
H  -1.860005 3.090868 -0.441664
H  3.773907 2.429819 1.763578
H  4.30712 -1.047466 -0.777006
H  1.933221 -2.9836 -2.85189
H  0.502717 -4.056581 -2.763473
H  2.065581 -4.564703 -2.035264
H  -3.008809 -2.818434 2.571315
H  -6.814844 2.32591 -0.244832
H  -3.429358 4.798362 -1.397591
H  -5.911886 4.419535 -1.300789
H  5.623959 3.609176 0.549788
H  6.164998 0.127362 -1.996474
H  6.823959 2.460439 -1.336107
