program: Gaussian 09
title: 000291220
version: EM64L-G09RevD.01
frameworkgroup: C1[X(C23H29ClO)]
method: RPBEPBE
basis: SDD
operation: Freq
keyword: #p
keyword: freq=noraman
keyword: PBEPBE/SDD
title: #p freq=noraman PBEPBE/SDD
converged: YES YES NO NO
title: Mulliken charges:
elementType: Cl O C C C C C C C C C C C C C C C C C C C C C C C H H H H H H H H H H H H H H H H H H H H H H H H H H H H H
charge: -0.050426 -0.294958 -0.007068 0.336060 0.336954 -0.040050 -0.415679 -0.419230 0.262476 0.258648 -0.356524 -0.373801 -0.689908 -0.406989 -0.408394 -0.381631 -0.381245 -0.283536 -0.282939 -0.276001 -0.276817 -0.709210 -0.706738 -0.195577 -0.703881 0.196953 0.197366 0.191209 0.191256 0.210341 0.210841 0.224213 0.223687 0.285548 0.285640 0.237436 0.237720 0.264586 0.264650 0.226590 0.226602 0.228627 0.228711 0.209107 0.209063 0.217495 0.204512 0.204488 0.221993 0.206276 0.206330 0.206376 0.224478 0.224370
chargesum: 0.00000
title: Mulliken charges with hydrogens summed into heavy atoms:
elementType: Cl O C C C C C C C C C C C C C C C C C C C C C C C
charge: -0.050426 -0.294958 -0.007068 0.336060 0.336954 -0.040050 -0.021360 -0.036765 0.262476 0.258648 0.064658 0.074099 -0.118720 -0.169553 -0.170675 -0.117045 -0.116594 -0.056946 -0.056338 -0.047374 -0.048106 -0.073545 -0.075745 0.217028 -0.048657
polarizability: 2.51452522e+02 2.24318724e+01 2.20488682e+02 1.55920524e+00 -4.55179564e+00 2.76562833e+02
1716.lowfreq: -8.5022 -0.0008 0.0008 0.0019 2.9711 10.0536 37.4983 52.2441 55.2663
frequency: 37.4034 52.2102 55.2106 57.2960 59.4275 62.2845 84.7492 87.4434 89.5060 93.1247 99.8957 103.4952 111.3299 170.9342 206.2367 219.5930 223.4053 226.3970 233.5254 237.7903 265.0650 279.5393 280.6444 299.6256 309.6018 312.0983 323.6499 351.7685 357.0139 361.6981 402.0425 435.7864 465.4060 500.2994 516.2629 539.4043 591.3997 601.7101 621.6308 625.7987 650.0340 663.3912 700.3130 732.0699 736.9535 742.7939 764.5494 768.0186 770.3254 778.6875 796.7860 817.3116 838.3147 857.1630 863.4640 867.2837 880.3917 884.9330 918.1236 918.8884 932.8838 955.7931 958.5114 972.3140 989.1374 990.6018 992.0747 1019.6104 1038.3134 1041.3787 1047.6072 1049.4201 1050.4923 1068.5310 1087.1281 1093.0374 1110.6709 1115.4481 1116.2467 1130.1749 1140.7074 1144.3749 1152.7476 1175.7500 1178.9358 1180.0171 1198.2062 1212.9258 1234.8532 1244.6103 1252.2708 1263.3729 1277.5926 1283.2870 1285.7283 1295.0507 1299.6158 1307.9104 1330.3796 1344.2235 1362.3521 1363.2546 1369.5677 1385.0225 1386.3613 1388.2586 1393.0044 1434.0451 1439.0596 1447.8291 1459.3870 1461.6447 1467.1699 1471.1929 1474.9855 1475.6262 1477.2433 1479.3447 1480.2590 1484.8862 1486.2226 1489.1272 1494.1511 1577.1581 1597.3874 1609.7894 1616.2777 2958.3764 2965.7911 2968.5165 2970.0287 2974.5455 2984.5244 2990.1040 2999.0422 3010.9075 3013.9993 3018.0111 3039.5921 3042.1144 3069.2222 3070.4358 3070.8079 3071.5782 3076.8381 3087.3842 3095.4994 3121.2643 3122.8432 3130.5061 3131.6125 3142.7562 3144.5711 3160.9200 3161.7190 3162.3409
redmass: 5.1221 3.6086 4.0313 3.8827 4.5033 3.2084 1.8982 3.2490 1.9900 3.5416 1.8644 4.6712 2.5607 4.3694 1.8952 1.2736 3.3006 1.3013 3.5120 1.5249 3.2399 3.9749 3.4566 2.3594 3.8236 4.6206 2.6185 2.9690 5.6836 3.6814 6.1254 3.6675 3.9538 3.0896 4.3116 3.5268 4.4755 3.6031 5.9467 4.1217 2.9651 5.8156 6.3228 1.2639 1.3375 4.8611 2.0901 1.8968 1.3837 2.1663 1.8060 1.1046 2.3076 2.7137 1.2446 1.9221 1.4876 1.8089 1.6314 1.5984 4.0660 1.4565 1.4257 2.1809 1.3325 1.3416 5.5514 3.0233 3.3599 4.6764 2.1268 2.5433 2.6948 2.9281 2.6247 1.3719 2.5476 1.9203 1.9711 2.5111 1.3981 1.2647 1.6572 3.3038 1.0822 1.0662 3.6391 1.6942 1.2906 1.3039 1.2145 1.2108 1.3067 1.5270 1.4682 1.1196 1.3809 1.9832 1.4772 1.4752 1.2973 1.5103 10.4780 4.4179 1.3379 1.2542 1.2595 2.1918 2.4002 1.0974 1.0413 1.0754 1.0684 1.0668 1.0545 1.0958 1.0621 2.1018 1.0886 1.1191 1.5267 1.3665 1.0844 7.1698 7.8122 6.0050 6.1838 1.0553 1.0398 1.0489 1.0435 1.0571 1.0589 1.0359 1.0605 1.0992 1.1061 1.0989 1.1021 1.1003 1.1017 1.0990 1.0986 1.1024 1.0558 1.0988 1.1011 1.0846 1.0843 1.0881 1.0883 1.0940 1.0937 1.1016 1.1007 1.1092
irintensity: 0.5298 0.1605 0.1675 0.0569 0.2917 0.0223 0.3130 0.2357 0.2628 0.5205 0.1202 0.6597 1.7478 0.4911 3.3182 0.7982 0.4397 0.3564 0.6003 1.3588 0.5940 1.3124 4.3273 2.3376 0.9794 2.0335 2.1588 1.3403 0.4636 1.5182 0.0050 5.2838 3.8117 0.0083 1.8538 0.0996 4.0468 0.9925 4.1434 6.8401 45.1204 0.2422 43.7633 1.3461 12.2288 11.5601 2.9416 37.2786 8.6250 54.3941 2.7010 2.5003 0.0871 11.0400 0.0964 0.7831 1.2472 8.9256 0.4064 1.0118 70.1472 1.9599 1.0560 13.1362 0.3040 0.1642 0.3205 10.6307 95.3338 1.6052 13.9930 1.0167 0.6833 1.1455 0.9385 0.0206 1.0867 8.3183 9.2167 0.5645 1.9248 0.5432 2.6600 0.0963 0.3568 0.6622 8.7804 1.4606 0.0103 0.9391 1.1373 5.4085 0.6749 2.7025 14.1525 1.7020 4.6472 30.7267 9.3218 0.2309 4.1895 0.0906 0.8329 0.7459 9.8805 13.5278 24.8241 12.5004 3.3479 18.4958 10.2162 0.7039 1.8929 1.2515 18.1133 10.3667 10.5830 20.5143 11.5136 2.0354 26.8014 14.3358 0.5492 0.9817 2.8148 4.4078 0.4502 49.0472 35.9821 22.7788 17.3207 53.3507 45.3093 29.3124 26.4754 4.7557 29.3749 14.3627 14.9316 0.6772 48.2686 43.3179 37.9046 103.8871 12.2191 28.7557 36.2320 2.3810 1.0969 7.7870 2.9822 18.7486 36.9259 42.3962 1.5794 27.2800
temp: 298.150 k
press: 1.00000 atm
elementType: 17 8 6 6 6 6 6 6 6 6 6 6 6 6 6 6 6 6 6 6 6 6 6 6 6 1 1 1 1 1 1 1 1 1 1 1 1 1 1 1 1 1 1 1 1 1 1 1 1 1 1 1 1 1
symmnumber: 1
zpe: 1200990.3 jmol-1
zpe.correction: 0.457433 hartree
zpe.thermalcorrener: 0.483055 hartree
zpe.thermalcorrenthalpy: 0.483999 hartree
zpe.thermalcorrgfe: 0.402186 hartree
zpe.sumelectzpe: -1427.267619 hartree
zpe.sumelectthermal: -1427.241997 hartree
zpe.sumelectthermalent: -1427.241053 hartree
zpe.sumelectthermalfe: -1427.322866 hartree
dipole: -1.0714 2.6081 0.2362
dipole: 2.8295
quadrupole: -154.3454 -161.7057 -146.1606
quadrupole: 7.4059 0.5375 -1.3060
quadrupole: -0.2748 -7.6351 7.9099 7.4059 0.5375 -1.3060
hfenergy: -1427.7250519 hartree
pointgroup: C01 [X(C23H29Cl1O1)]
dipole: 0.2220282 -0.1555451 -1.0796873 debye
polarizability: 266.0988494|9.7496613|267.9164679|14.366521|-9.6736759|214.4887189 unknown
InChI: InChI=1S/C23H29ClO/c1-4-15-22(16-5-2)18-11-7-9-13-20(18)23(17-24,25-6-3)21-14-10-8-12-19(21)22/h7-14H,4-6,15-17H2,1-3H3
charge 0 multiplicity 1
54 atoms
Cl -0.292959 0.13945 3.55024
O  1.937382 -1.948546 0.867481
C  -0.803005 0.967044 -0.664475
C  0.577137 1.348968 -0.096029
C  -1.247675 -0.445277 -0.242418
C  0.890857 -0.900242 1.148568
C  -0.721868 1.016864 -2.243628
C  -1.885158 2.03256 -0.246549
C  1.372537 0.475067 0.691409
C  -0.45325 -1.315013 0.550531
C  0.292014 0.06138 -2.906597
C  -2.158989 2.177266 1.263527
C  0.90021 -1.031481 2.697804
C  1.113391 2.627088 -0.41874
C  -2.5029 -0.929144 -0.707598
C  2.675344 0.875454 1.094918
C  -0.905278 -2.635056 0.821281
C  2.393492 3.02866 0.003432
C  -2.956566 -2.228391 -0.417556
C  3.192408 2.138096 0.759407
C  -2.143557 -3.099226 0.34642
C  0.284457 0.193155 -4.444793
C  -3.232866 3.249239 1.549531
C  2.248549 -2.169158 -0.558982
C  3.308117 -3.268716 -0.61264
H  -0.484198 2.056857 -2.544824
H  -1.73175 0.804837 -2.648146
H  -2.835171 1.783178 -0.761356
H  -1.577394 3.017384 -0.652895
H  0.056027 -0.982625 -2.623626
H  1.308439 0.276077 -2.523621
H  -1.222476 2.438345 1.790665
H  -2.482417 1.204864 1.67964
H  1.892707 -0.7892 3.099898
H  0.594019 -2.040945 3.002305
H  0.516488 3.322956 -1.017915
H  -3.139876 -0.275031 -1.312793
H  3.292181 0.166018 1.657665
H  -0.25363 -3.306769 1.390954
H  2.77072 4.022839 -0.26095
H  -3.931065 -2.563864 -0.789635
H  4.19912 2.427535 1.079667
H  -2.473907 -4.120342 0.565521
H  -0.714007 -0.041449 -4.860378
H  0.544539 1.222351 -4.757776
H  1.013342 -0.49469 -4.911585
H  -2.919533 4.241291 1.170628
H  -4.194591 2.993361 1.064251
H  -3.419381 3.347228 2.634613
H  1.327708 -2.472371 -1.09753
H  2.623018 -1.22707 -1.008415
H  3.585386 -3.480194 -1.661814
H  4.217559 -2.96298 -0.06634
H  2.928612 -4.200336 -0.15765
