program: Gaussian 09
title: 000291146
version: EM64L-G09RevD.01
frameworkgroup: C1[X(C8H9ClN4O2)]
method: RPBEPBE
basis: SDD
operation: Freq
keyword: #p
keyword: freq=noraman
keyword: PBEPBE/SDD
title: #p freq=noraman PBEPBE/SDD
converged: YES YES NO NO
title: Mulliken charges:
elementType: Cl O O N N N N C C C C C C C C H H H H H H H H H
charge: -0.018276 -0.216357 -0.215069 -0.035355 -0.129000 -0.016368 0.018211 0.287636 0.406271 -0.256610 -0.252396 -0.373591 -0.367549 -0.612274 -0.597679 0.274536 0.309687 0.285879 0.222846 0.270031 0.270634 0.240928 0.263031 0.240834
chargesum: 0.00000
title: Mulliken charges with hydrogens summed into heavy atoms:
elementType: Cl O O N N N N C C C C C C C C
charge: -0.018276 -0.216357 -0.215069 -0.035355 -0.129000 -0.016368 0.018211 0.287636 0.406271 -0.256610 0.022140 -0.063904 -0.081670 0.151237 0.147114
polarizability: 3.15121103e+02 2.79725369e-01 1.48688772e+02 1.37881578e-01 -6.37507011e-02 5.95280199e+01
1716.lowfreq: -7.6808 -6.3595 -0.0005 0.0014 0.0014 4.6406 16.9401 48.9130 64.6194
frequency: 16.5525 48.9124 64.6180 76.9850 104.2860 124.8615 162.2244 166.0288 169.6491 220.3550 234.6110 242.6034 331.2647 349.3635 389.0384 393.9296 403.6142 461.5355 491.5162 539.0099 543.8380 591.5980 642.4742 690.4057 700.2305 749.0161 785.3428 838.6629 859.6234 897.6688 920.0156 996.0144 1022.7970 1037.0362 1069.7506 1080.3530 1101.5919 1128.9098 1130.4511 1197.6635 1211.9417 1243.0755 1285.4675 1324.3441 1340.5278 1350.9526 1385.8294 1418.3970 1419.7327 1439.3725 1441.0251 1456.3287 1467.3944 1477.4473 1489.5160 1566.9703 1594.5379 2980.1327 2994.1825 3059.1985 3075.3179 3125.4326 3130.1942 3166.9807 3188.0750 3190.9593
redmass: 3.0499 6.3363 10.2633 5.2480 1.2721 1.5375 14.0656 2.6956 3.0284 5.0411 6.0625 2.8917 10.3741 6.0228 3.4170 6.6359 5.9922 3.8487 6.7842 4.4979 5.5827 5.5265 7.4266 6.2152 10.0086 4.0914 6.8144 5.9857 1.5129 5.8860 1.4252 1.3391 2.7629 1.4727 2.1551 1.2488 3.5941 1.3590 1.2804 4.1848 5.2442 1.7227 4.0290 5.9492 3.2787 6.4829 6.9351 1.5912 2.4562 1.0444 1.2415 2.6578 1.0446 1.0819 1.1766 8.6993 7.2404 1.0354 1.0334 1.1019 1.0997 1.1017 1.0992 1.0881 1.0958 1.0935
irintensity: 0.2261 0.0322 0.0193 0.6626 1.7995 4.5323 2.2141 4.6275 2.7479 0.3443 0.5445 0.5597 3.2340 0.0520 1.1140 1.7133 4.4521 7.3426 10.3526 0.9647 9.3730 16.1970 2.3345 17.0206 23.3237 1.5409 5.5361 47.0290 31.8625 4.5325 29.4949 0.1203 31.1892 22.0449 103.4672 0.0674 55.4170 0.5771 34.2613 510.0600 355.6698 78.7712 36.0144 386.2424 183.3094 33.4189 97.8030 16.8917 41.0775 20.7820 19.3648 80.1372 14.7249 16.8769 59.9556 10.6985 118.5021 68.4370 45.4510 25.9023 11.7580 9.0324 11.8397 1.0245 0.2792 6.6011
temp: 298.150 k
press: 1.00000 atm
elementType: 17 8 8 7 7 7 7 6 6 6 6 6 6 6 6 1 1 1 1 1 1 1 1 1
symmnumber: 1
zpe: 447389.8 jmol-1
zpe.correction: 0.170402 hartree
zpe.thermalcorrener: 0.185244 hartree
zpe.thermalcorrenthalpy: 0.186188 hartree
zpe.thermalcorrgfe: 0.126204 hartree
zpe.sumelectzpe: -1138.521937 hartree
zpe.sumelectthermal: -1138.507095 hartree
zpe.sumelectthermalent: -1138.506151 hartree
zpe.sumelectthermalfe: -1138.566134 hartree
dipole: 10.0493 -1.6253 0.0062
dipole: 10.1799
quadrupole: -91.6771 -92.6012 -93.9867
quadrupole: -9.3583 0.0053 0.0248
quadrupole: 1.0779 0.1538 -1.2317 -9.3583 0.0053 0.0248
hfenergy: -1138.6923385 hartree
pointgroup: C01 [X(C8H9Cl1N4O2)]
dipole: 3.9336336 0.6673832 -0.3488417 debye
dipolederiv: -0.0965693 0.2297834 -0.0808522 0.1716471 -0.5947344 0.189597 -0.0601012 0.1878122 -0.1149179 -0.8958885 0.2148871 -0.057841 0.51945 -0.6700654 0.1402574 -0.1668138 0.1491847 -0.2848762 -1.0125167 -0.1684925 0.0828181 -0.4614861 -0.5793027 0.1365372 0.1873952 0.1277557 -0.2870868 -1.7525226 -0.3582334 0.1664933 0.0296541 -0.0921018 -0.0450005 0.0465801 -0.0290076 -0.2132856 -1.6235583 -0.1191484 0.0862261 -1.1659215 -0.2598117 0.076073 0.4470783 0.0444428 -0.1670048 1.9480388 0.4006428 -0.197074 0.7936119 -0.1477079 0.0119196 -0.3340765 0.020381 -0.0352761 2.6149755 -0.0990424 -0.0347764 -0.1270288 0.9673764 -0.2762941 -0.0243953 -0.2770152 0.2860902 1.6375055 0.1554681 -0.1020099 0.0355001 -0.0996472 0.0569317 -0.0635793 0.0545888 0.0468194 -1.3682659 0.070744 0.0157028 0.2152081 0.0820834 -0.0196256 -0.0365013 -0.0165075 0.0502481 -0.5428575 -0.4781636 0.1840044 -0.5481532 0.882944 -0.3289853 0.2100391 -0.332314 0.0280676 -0.5170186 0.0396725 -0.0027749 0.4264157 -0.0508642 -0.0386472 -0.141494 -0.0266993 -0.1083424 0.4584962 0.1711211 -0.0763798 -0.2759285 -0.20875 0.0598448 0.0819186 0.0472365 -0.0830698 0.4023534 -0.0776807 0.0121378 0.1618044 -0.0384461 -0.0305573 -0.0740628 -0.0227377 -0.0993179 0.289178 -0.0440947 0.0113336 -0.2144919 0.1041659 0.0337363 0.0614398 0.0289709 0.1710121 0.3141438 0.1949535 -0.0661911 0.5596306 0.263219 -0.0263347 -0.1897 -0.0162606 0.2437792 0.0678641 -0.0543404 0.0227098 -0.0399407 0.0255948 0.0474136 0.0192093 0.047215 0.1367547 0.1161946 -0.0414042 0.0165781 0.0043736 0.1008591 0.0268624 0.0008055 0.0284773 0.1662924 0.083257 0.0547726 -0.0170101 0.0139602 0.0615795 0.0380091 -0.0018638 0.0371691 0.1558834 -0.1640212 0.0022266 0.006891 -0.0361559 0.0961424 0.0100477 0.0194364 0.0092285 0.1217098 0.0657853 -0.0609212 -0.0576131 0.0792259 -0.0021944 -0.0542503 -0.0200018 -0.0699144 0.0137062 0.0661591 -0.0131954 0.0779676 0.0771815 0.06186 0.0120423 -0.0358108 0.0342649 -0.0512383 -0.0929275 -0.1003639 -0.0649962 -0.1756933 0.053284 0.0103126 -0.1167991 -0.053209 -0.0493641 0.0807266 0.1205338 -0.0387963 0.028392 0.0045907 0.0424894 -0.0077758 0.0399803 0.1221709 -0.0785319 -0.0397246 0.1134525 -0.0712555 0.0399267 -0.072379 0.1990733 -0.0130425 -0.0487539 unknown
polarizability: 314.8282705|1.6456511|138.8293605|-7.9228407|-28.07774|69.6802647 unknown
InChI: InChI=1S/C8H9ClN4O2/c1-12(2)11-10-8-4-3-6(13(14)15)5-7(8)9/h3-5H,1-2H3
charge 0 multiplicity 1
24 atoms
Cl 0.330503 -2.786345 1.021189
O  -4.318872 1.399105 -0.338607
O  -4.52761 -0.740903 0.433362
N  3.908402 0.438535 -0.227073
N  1.864527 -0.374376 0.110061
N  2.581178 0.678956 -0.26364
N  -3.817363 0.270961 0.050913
C  0.469008 -0.14108 0.072481
C  -2.349544 0.13377 0.057784
C  -0.387291 -1.209549 0.478911
C  -0.153266 1.078497 -0.343619
C  -1.782842 -1.089928 0.477584
C  -1.545415 1.22311 -0.35416
C  4.459503 -0.865112 0.189562
C  4.782462 1.54982 -0.617641
H  0.495761 1.900919 -0.656318
H  -2.432084 -1.91092 0.789856
H  -2.027414 2.151147 -0.67156
H  5.558005 -0.811243 0.143575
H  4.085465 -1.668078 -0.470359
H  4.127501 -1.110759 1.214108
H  5.449944 1.83553 0.216372
H  4.146597 2.406918 -0.883958
H  5.404743 1.272125 -1.488423
