program: Gaussian 09
title: 000027965
version: EM64L-G09RevD.01
frameworkgroup: C1[X(C12H16N2O)]
method: RPBEPBE
basis: SDD
operation: Freq
keyword: #p
keyword: freq=noraman
keyword: PBEPBE/SDD
title: #p freq=noraman PBEPBE/SDD
converged: YES YES NO NO
title: Mulliken charges:
elementType: O N N C C C C C C C C C C C C H H H H H H H H H H H H H H H H
charge: -0.276637 -0.414008 -0.093253 0.353727 0.110640 -0.472511 0.255585 -0.410349 -0.564776 -0.348402 0.328068 -0.352191 -0.629852 -0.616933 -0.539066 0.220546 0.194398 0.283887 0.300229 0.253354 0.223062 0.235766 0.218390 0.249365 0.186632 0.221418 0.185750 0.226014 0.240296 0.215387 0.215461
chargesum: 0.00000
title: Mulliken charges with hydrogens summed into heavy atoms:
elementType: O N N C C C C C C C C C C C C
charge: -0.276637 -0.113779 -0.093253 0.353727 0.110640 -0.057566 0.255585 -0.126462 -0.311422 -0.125341 0.328068 -0.116425 0.024535 0.016250 0.132079
polarizability: 2.14893990e+02 -1.07488086e+01 1.50636124e+02 7.20029979e+00 3.44059316e+00 8.71138543e+01
1716.lowfreq: -4.1421 -0.0005 -0.0004 -0.0002 2.6118 7.7510 38.2277 68.5139 73.4939
frequency: 37.8166 68.5111 73.4848 84.6705 147.1903 172.8582 193.8901 238.8764 241.9122 243.6161 247.9549 306.9963 320.1897 356.4191 370.9614 381.9134 416.2494 426.4183 461.8565 485.0117 550.1404 589.6419 615.9408 641.0149 706.6472 745.0551 753.3330 781.7785 808.3855 813.0143 830.0211 870.6509 899.2253 908.7611 975.3279 1002.6911 1012.5976 1034.0308 1056.0281 1085.9224 1091.9087 1112.4304 1135.1247 1135.6192 1161.5424 1169.0715 1185.0462 1233.3094 1240.1076 1260.4936 1274.7814 1290.2068 1306.3181 1361.1376 1400.0529 1416.0334 1425.7129 1438.0940 1439.8682 1459.7249 1461.2696 1464.2925 1465.7108 1471.1581 1477.4064 1479.4360 1485.6607 1486.8217 1565.8374 1587.2928 1643.7220 2829.6861 2846.5540 2862.5725 2948.6089 2980.5131 3016.0078 3025.6213 3032.0763 3075.5675 3088.9047 3115.2377 3132.3762 3160.0489 3166.5463 3233.2419 3616.8122
redmass: 3.0879 2.9486 3.1082 3.7457 3.6399 3.6208 3.4587 3.1012 1.2262 1.1775 1.0706 3.4890 2.7310 2.1407 5.6316 4.2997 2.7475 2.8819 3.4905 1.2465 4.3038 2.5396 5.1763 3.7477 4.5898 5.8204 3.3048 1.6211 4.3856 3.2532 1.5766 1.6089 4.8711 1.3387 1.8802 3.3629 2.5582 1.5288 2.6705 1.4619 1.2678 1.2587 1.4212 1.4105 1.3061 1.9013 2.5461 2.0464 2.0769 2.4478 1.6050 2.8043 1.9342 1.8042 3.4878 1.1416 1.6894 1.2268 1.4533 1.1442 2.9199 1.0760 1.0514 1.4160 1.0640 1.0840 2.0775 1.0583 6.1322 6.0005 7.5018 1.0701 1.0577 1.0574 1.0334 1.0853 1.0718 1.0729 1.1035 1.1011 1.1000 1.0984 1.0890 1.0918 1.0941 1.0983 1.0808
irintensity: 0.5568 1.6272 9.2194 1.9461 0.1906 2.3959 0.9335 2.5939 0.1089 0.6182 1.5897 3.0668 5.9429 5.3848 6.2002 2.2812 2.7943 5.8520 4.5098 97.1112 7.3259 14.3379 6.9529 6.4094 13.5236 2.1908 2.3134 56.7360 1.5820 8.1299 25.7037 31.5972 6.2737 1.0544 2.6455 58.2336 89.0848 16.1486 13.5078 31.9874 5.7831 0.2428 1.3173 3.6458 10.3818 7.6708 159.8805 31.1003 3.9829 15.0338 8.8686 22.3636 31.8976 3.3415 68.5928 5.8045 33.9236 7.7660 5.1096 19.3222 25.3611 3.9728 12.4828 86.3338 17.0840 10.2329 13.5886 8.8040 10.4669 48.6913 32.6358 49.6248 79.6536 211.2017 87.5738 33.8861 45.9745 44.1635 57.8442 35.1700 36.6128 30.9423 11.6164 5.0789 14.8260 0.0410 57.5333
temp: 298.150 k
press: 1.00000 atm
elementType: 8 7 7 6 6 6 6 6 6 6 6 6 6 6 6 1 1 1 1 1 1 1 1 1 1 1 1 1 1 1 1
symmnumber: 1
zpe: 677161.6 jmol-1
zpe.correction: 0.257917 hartree
zpe.thermalcorrener: 0.272606 hartree
zpe.thermalcorrenthalpy: 0.273550 hartree
zpe.thermalcorrgfe: 0.216262 hartree
zpe.sumelectzpe: -650.452703 hartree
zpe.sumelectthermal: -650.438014 hartree
zpe.sumelectthermalent: -650.437070 hartree
zpe.sumelectthermalfe: -650.494358 hartree
dipole: 0.5005 1.9639 0.4944
dipole: 2.0861
quadrupole: -73.0299 -78.5284 -93.3481
quadrupole: 2.9284 1.0128 1.2645
quadrupole: 8.6056 3.1071 -11.7126 2.9284 1.0128 1.2645
hfenergy: -650.7106201 hartree
pointgroup: C01 [X(C12H16N2O1)]
dipole: 0.1864047 -0.7663302 -0.2271288 debye
polarizability: 215.5217091|9.6491975|149.7542605|-3.9541036|6.757714|87.3679986 unknown
InChI: InChI=1S/C12H16N2O/c1-14(2)8-9-7-13-12-5-4-10(15-3)6-11(9)12/h4-7,13H,8H2,1-3H3
charge 0 multiplicity 1
31 atoms
O  3.343658 1.734643 0.118543
N  -0.423786 -2.384435 -0.067315
N  -3.54458 0.638532 -0.100106
C  -1.249048 -0.274346 0.250861
C  0.197764 -0.192145 0.144981
C  -2.206828 0.864541 0.506605
C  0.690928 -1.533306 -0.055658
C  -1.585679 -1.621423 0.119872
C  1.120057 0.882172 0.199524
C  2.064324 -1.807903 -0.200334
C  2.494986 0.605272 0.052772
C  2.970514 -0.727277 -0.145511
C  -3.514344 0.702964 -1.576407
C  -4.570406 1.535793 0.466888
C  4.779515 1.509782 -0.025248
H  -2.361111 0.989858 1.597784
H  -1.746207 1.822194 0.146406
H  -2.575827 -2.071646 0.138079
H  -0.396855 -3.391403 -0.206321
H  0.80249 1.917736 0.353988
H  2.434492 -2.828139 -0.351449
H  4.040437 -0.925926 -0.255539
H  -4.502032 0.418208 -1.98182
H  -2.761554 -0.004692 -1.962183
H  -3.26002 1.723265 -1.96269
H  -5.559092 1.280956 0.044293
H  -4.379818 2.620341 0.258909
H  -4.620779 1.401673 1.562442
H  5.23683 2.507402 0.05695
H  5.027439 1.069557 -1.011904
H  5.173233 0.855253 0.778088
