program: Gaussian 09
title: 000291133
version: EM64L-G09RevD.01
frameworkgroup: C1[X(C11H8N4)]
method: RPBEPBE
basis: SDD
operation: Freq
keyword: #pfreq=noraman
keyword: PBEPBE/SDD
title: #p freq=noraman PBEPBE/SDD
converged: NO NO NO NO
title: Mulliken charges:
elementType: N N N N C C C C C C C C C C C H H H H H H H H
charge: -0.275963 -0.046775 -0.087291 -0.008435 0.292024 -0.051466 0.439645 -0.265897 -0.279728 -0.222274 -0.271711 -0.300668 -0.216750 -0.336552 -0.329985 0.230913 0.261555 0.232545 0.215850 0.291455 0.238597 0.242546 0.248363
chargesum: 0.00000
title: Mulliken charges with hydrogens summed into heavy atoms:
elementType: N N N N C C C C C C C C C C C
charge: -0.275963 -0.046775 -0.087291 -0.008435 0.292024 -0.051466 0.439645 -0.034984 -0.018172 0.010271 -0.055861 -0.009213 0.021847 -0.094006 -0.081622
polarizability: 2.33565409e+02 -4.70897321e+00 1.52908681e+02 -4.24721827e-02 -2.36313634e-02 5.51572670e+01
1716.lowfreq: -38.8875 -0.0010 -0.0009 0.0005 7.2352 10.9781 14.1298 73.4245 141.4882
frequency: -38.6513 73.4125 141.4882 187.0903 221.1728 290.7243 318.3876 333.9157 370.1119 422.3792 477.9112 529.0342 553.4015 579.5373 611.2939 634.2652 659.0729 694.2656 735.5864 753.1049 758.6888 769.4334 813.6958 853.0091 869.9882 876.0918 893.1610 948.0684 955.9903 960.8165 984.4395 984.5459 988.7277 1016.7801 1056.4243 1093.5914 1118.4166 1155.7251 1183.5635 1219.3255 1226.4021 1252.8649 1288.7185 1312.4465 1336.6077 1374.6441 1407.7406 1418.9712 1443.8915 1466.8482 1480.9689 1557.4440 1580.8119 1589.4922 1620.1646 3135.9545 3143.1453 3143.5309 3161.2378 3182.1757 3195.0510 3201.4495 3218.0152
redmass: 3.8578 5.3581 5.6113 5.4271 5.9759 6.0850 7.1483 6.2712 2.5094 2.8625 7.3740 3.4049 8.0966 3.7243 7.2461 6.9640 6.9982 7.0359 3.0142 3.2384 1.5593 6.1129 1.5483 1.4320 1.2774 8.7460 8.7376 1.3867 1.4017 6.8167 1.4894 5.0095 1.3223 2.1889 2.0896 1.5279 1.9166 2.0166 1.5216 2.6260 1.3733 6.7917 1.6229 5.3535 1.4269 2.9765 2.4024 2.9208 4.1832 2.5336 2.8158 7.4689 5.7424 7.2408 7.5953 1.0902 1.0878 1.0917 1.0915 1.0978 1.0963 1.0950 1.0913
irintensity: 0.7095 0.2832 1.1444 5.2154 0.1035 0.6509 0.7492 1.0118 0.0062 6.3044 3.2042 10.5770 3.0720 7.2032 10.0088 11.2708 0.1082 12.1409 0.0253 20.8405 58.0753 32.1266 76.2964 0.7793 10.9024 117.1704 20.8997 0.9241 1.2293 6.9946 1.9726 11.4823 0.0411 10.1748 4.5725 2.5533 0.1152 0.9729 32.6479 4.1457 3.2173 57.5441 10.5582 3.0468 2.2914 30.8038 3.3441 24.1326 55.9480 1.8908 123.3385 9.3826 236.9311 22.2124 8.2496 22.8792 8.4351 13.5007 12.6465 14.1482 3.8572 0.7371 9.8311
temp: 298.150 k
press: 1.00000 atm
elementType: 7 7 7 7 6 6 6 6 6 6 6 6 6 6 6 1 1 1 1 1 1 1 1
symmnumber: 1
zpe: 447554.2 jmol-1
zpe.correction: 0.170464 hartree
zpe.thermalcorrener: 0.180246 hartree
zpe.thermalcorrenthalpy: 0.181190 hartree
zpe.thermalcorrgfe: 0.134835 hartree
zpe.sumelectzpe: -641.915546 hartree
zpe.sumelectthermal: -641.905764 hartree
zpe.sumelectthermalent: -641.904820 hartree
zpe.sumelectthermalfe: -641.951176 hartree
dipole: -2.9960 3.3402 -0.0029
dipole: 4.4870
quadrupole: -87.5752 -83.9528 -90.5666
quadrupole: -9.3278 -0.0404 -0.0154
quadrupole: -0.2103 3.4120 -3.2017 -9.3278 -0.0404 -0.0154
hfenergy: -642.0860107 hartree
pointgroup: C01 [X(C11H8N4)]
dipole: 1.1457934 -1.3362526 -0.1338708 debye
dipolederiv: -1.3071294 -0.075323 -0.0162743 -0.6103267 -0.5220357 -0.0601736 -0.0746606 -0.0569547 0.0047095 0.2511039 0.6314504 0.0692927 0.8896852 0.3476405 0.0594511 0.0972811 0.0581502 -0.1466551 -0.784119 -0.5099406 -0.0576668 -0.0087519 0.0844694 0.0266163 -0.0045175 0.0229095 -0.1654187 -0.5196979 0.019703 0.0004106 -0.0750364 -0.3875361 -0.0160579 -0.0090934 -0.0155381 -0.240805 0.5892937 -0.212531 -0.0191628 -0.5442213 -0.0569812 -0.017943 -0.0536128 -0.0160482 0.0767986 0.0530065 0.0456799 0.0050116 -0.3467815 -0.161938 -0.0244051 -0.0364539 -0.0219149 0.0453872 1.6302585 0.1509558 0.0246552 0.3618515 0.2009449 0.0107087 0.0469917 0.0093924 0.1185684 -0.226397 0.0335145 0.0037885 0.2827132 0.0495899 0.0236512 0.0298592 0.0221208 -0.153731 0.0580628 -0.0577472 -0.0043933 0.1640791 0.1740869 0.0308436 0.0188902 0.0295208 -0.1059569 0.1629743 0.0987476 0.0127237 0.032645 0.1765363 0.0335161 0.0057325 0.0344093 -0.1340398 -0.4045818 -0.1632845 -0.018731 -0.3068168 -0.1780081 -0.0073764 -0.0333992 -0.0064296 -0.1271039 -0.6218907 0.1044799 0.0079527 0.1291476 -0.0545256 0.0055556 0.0113958 0.0054501 -0.0995958 0.0533487 -0.0748635 -0.0054277 -0.1264718 -0.2383687 -0.0083537 -0.0111549 -0.0081535 -0.1696851 0.3061252 0.1472322 0.0170683 0.0909862 0.3378075 0.0445419 0.0110901 0.0446626 -0.0771218 0.4700981 -0.1941343 -0.0178201 -0.0048185 0.2597653 0.0356148 0.0015298 0.0349258 -0.0768529 0.0144781 -0.1092486 -0.0131765 -0.0841017 0.0191289 -0.0167128 -0.0104366 -0.0169234 0.1684577 0.0288233 -0.0495722 -0.0064798 -0.0881111 0.0319567 -0.0150839 -0.0107785 -0.0147914 0.1664826 0.0725652 0.0465185 0.0041598 0.0633971 -0.0851307 -0.0250911 0.0060097 -0.0252905 0.1540954 0.0576619 0.1086101 0.0110778 0.1051354 0.0084259 -0.0153549 0.0104174 -0.0152957 0.1594273 0.1613033 -0.0533043 -0.0054477 -0.0301242 0.0379861 -0.0141662 -0.0031074 -0.014413 0.1703108 -0.1040794 0.0517134 0.0029729 0.0616783 0.0798567 -0.0084916 0.0040622 -0.0085642 0.1648585 0.0656465 -0.0390848 -0.0044191 -0.0526847 -0.0993336 -0.0248993 -0.0056863 -0.0248086 0.133303 -0.0068548 0.1004289 0.0098853 0.0969281 -0.0243372 -0.0163895 0.0096414 -0.0164157 0.1345671 unknown
polarizability: 233.2755334|-6.7821915|152.1329103|0.4402464|10.1303026|56.2229138 unknown
InChI: InChI=1S/C11H8N4/c1-2-4-11-10(3-1)13-14-15(11)9-5-7-12-8-6-9/h1-8H
charge 0 multiplicity 1
23 atoms
N  -0.061153 0.504254 0.107825
N  0.248652 1.911973 0.260161
N  1.566677 2.045775 0.283645
N  -4.214937 -0.533688 -0.018495
C  1.131484 -0.22386 0.040005
C  2.159397 0.771446 0.153217
C  -1.434667 0.133564 0.061925
C  1.477318 -1.590956 -0.101319
C  3.53235 0.440291 0.131038
C  2.848953 -1.910499 -0.122255
C  -1.856198 -1.211194 -0.080549
C  -2.429568 1.141534 0.16328
C  3.867149 -0.917244 -0.008094
C  -3.241523 -1.48443 -0.114371
C  -3.783388 0.759012 0.118202
H  0.741413 -2.390259 -0.193082
H  4.29076 1.222774 0.220494
H  3.141893 -2.960424 -0.230773
H  -1.15639 -2.041671 -0.163866
H  -2.14097 2.187666 0.274312
H  4.918137 -1.221773 -0.030165
H  -3.590437 -2.517603 -0.223744
H  -4.569652 1.51791 0.194809
