program: Gaussian 09
title: 000291155
version: EM64L-G09RevD.01
frameworkgroup: C1[X(C17H17BrOS)]
method: RPBEPBE
basis: SDD
operation: Freq
keyword: #p
keyword: freq=noraman
keyword: PBEPBE/SDD
title: #p freq=noraman PBEPBE/SDD
converged: YES YES NO NO
title: Mulliken charges:
elementType: Br S O C C C C C C C C C C C C C C C C C H H H H H H H H H H H H H H H H H
charge: 0.007457 0.185710 -0.274212 0.350464 0.440950 -0.381475 -0.338309 -0.362900 -0.424493 -0.332941 -0.754302 -0.158102 -0.096712 -0.208011 -0.808055 -0.237687 -0.182783 -0.175025 -0.175412 -0.205115 0.213556 0.214124 0.245424 0.237823 0.227005 0.230684 0.270105 0.273577 0.251070 0.239504 0.228860 0.229273 0.222659 0.262229 0.279496 0.253017 0.252548
chargesum: 0.00000
title: Mulliken charges with hydrogens summed into heavy atoms:
elementType: Br S O C C C C C C C C C C C C C C C C C
charge: 0.007457 0.185710 -0.274212 0.350464 0.440950 0.046205 -0.092884 -0.125077 -0.197488 -0.102257 -0.210620 0.092968 0.142792 -0.208011 -0.127264 0.024542 0.096713 0.077991 0.077135 -0.205115
polarizability: 2.73065593e+02 1.70656411e+01 2.80977491e+02 3.56816593e+00 1.72925550e+00 1.21336794e+02
1716.lowfreq: -8.3860 -2.0510 0.0010 0.0016 0.0016 3.7867 7.3625 11.9196 24.8591
frequency: -2.1160 11.9073 24.7274 32.2697 52.3369 59.0782 68.1032 78.0181 127.0970 137.4993 157.7905 176.5455 182.3406 242.7087 246.9148 272.6807 306.2285 310.7015 328.9318 329.7827 362.3696 410.6184 413.3637 442.2554 456.1531 477.6256 501.5955 507.6449 555.8196 596.8661 618.3286 633.8057 701.4550 703.1893 710.5652 726.1770 805.7874 808.5481 824.5233 827.1903 830.0576 851.9198 878.9129 928.5606 939.6007 956.2485 960.6312 965.6313 970.8169 981.0161 985.6903 986.1561 1005.6815 1047.5540 1052.7351 1070.9534 1081.5634 1101.7095 1111.4147 1121.1779 1161.8724 1177.7650 1183.0371 1208.8591 1210.6409 1218.5104 1223.1925 1282.6482 1294.1501 1304.5632 1305.9318 1352.1983 1359.5041 1372.1295 1375.6987 1400.2777 1413.9003 1437.8249 1449.9573 1471.3035 1473.3762 1477.5640 1501.3506 1566.3287 1568.7034 1585.7862 1625.3107 1679.2825 2949.4335 2973.9291 3012.4776 3031.7640 3050.6813 3081.1978 3095.9396 3116.1665 3121.9079 3122.4294 3124.7200 3150.8937 3157.6756 3161.6807 3164.0155 3173.5990 3184.4972
redmass: 4.3790 8.4821 4.7212 5.2278 4.5846 1.2108 3.3520 5.1335 3.2337 5.9468 3.6855 2.9642 8.1460 3.8218 5.1280 4.7454 4.0307 4.6798 2.7091 4.2468 4.2590 2.8942 2.9304 4.0517 8.3942 3.8509 3.0932 2.4720 3.2638 5.3255 7.1521 6.8070 4.7615 5.4718 2.9996 4.5733 2.4901 1.8558 1.3848 1.3908 1.2591 2.0804 1.7997 1.3422 4.8473 1.3411 1.3958 1.5559 1.3850 1.2214 1.5828 4.6098 2.6079 1.5251 4.8322 2.1352 1.5768 1.3982 2.9223 1.2706 1.3185 1.4088 1.1201 1.5520 1.4787 1.2022 3.5445 1.2360 1.2662 1.2468 1.2752 4.4902 1.7384 3.9834 2.6801 1.2480 3.5113 1.1324 2.0990 1.0455 1.1306 1.0966 2.5017 6.3347 7.7344 6.4143 6.4314 6.2791 1.0557 1.0372 1.1064 1.0583 1.0978 1.0985 1.0946 1.1034 1.0918 1.0891 1.0888 1.0889 1.0947 1.0949 1.0892 1.0967 1.0971
irintensity: 0.2330 0.0345 0.3081 0.2241 0.2120 0.8243 1.2671 0.7740 1.0864 0.9801 0.8744 0.2298 0.6874 3.8408 2.5731 0.1061 0.6674 2.2023 1.0297 4.0305 7.3809 0.0533 0.0308 1.3759 8.3441 4.9669 26.7960 25.4559 4.1554 6.8862 0.0860 0.3745 3.8190 8.0197 0.3828 14.9289 20.1096 24.9398 6.3368 81.8075 10.5235 20.2929 7.5913 1.9191 99.4606 0.8796 0.5430 4.1949 0.4437 65.6674 5.8896 74.9550 6.9709 10.9452 19.3717 11.4247 6.5539 7.4622 12.8918 15.8031 2.0944 114.5424 3.4636 98.5639 104.0717 7.9827 17.2683 0.2983 0.3381 1.5799 3.6849 0.7620 15.3336 13.0811 23.5197 10.9915 1.2930 11.8183 71.0813 12.3534 25.7234 11.9688 154.8012 20.4872 1.3213 19.0127 34.4191 2.8854 42.0610 50.6092 27.7601 22.2089 23.5743 20.1080 3.5435 1.7572 33.2391 12.2579 29.0884 1.0097 19.8362 5.8830 2.2132 6.1075 0.6870
temp: 298.150 k
press: 1.00000 atm
elementType: 35 16 8 6 6 6 6 6 6 6 6 6 6 6 6 6 6 6 6 6 1 1 1 1 1 1 1 1 1 1 1 1 1 1 1 1 1
symmnumber: 1
zpe: 756113.2 jmol-1
zpe.correction: 0.287988 hartree
zpe.thermalcorrener: 0.307506 hartree
zpe.thermalcorrenthalpy: 0.308450 hartree
zpe.thermalcorrgfe: 0.235778 hartree
zpe.sumelectzpe: -1143.276652 hartree
zpe.sumelectthermal: -1143.257135 hartree
zpe.sumelectthermalent: -1143.256191 hartree
zpe.sumelectthermalfe: -1143.328863 hartree
dipole: -1.9233 2.2059 1.4184
dipole: 3.2522
quadrupole: -121.5934 -126.4428 -139.5197
quadrupole: 1.4120 4.9879 7.3977
quadrupole: 7.5919 2.7425 -10.3344 1.4120 4.9879 7.3977
hfenergy: -1143.5646406 hartree
pointgroup: C01 [X(C17H17Br1O1S1)]
dipole: 0.5361852 -1.1238533 0.2943326 debye
polarizability: 281.2099926|19.0458247|265.6903648|-8.8969447|29.9039089|128.4795212 unknown
InChI: InChI=1S/C17H17BrOS/c1-14-4-8-16(9-5-14)19-12-2-3-13-20-17-10-6-15(18)7-11-17/h2-11H,12-13H2,1H3
charge 0 multiplicity 1
37 atoms
Br -2.789229 4.311626 1.389843
S  -4.055014 -1.663599 -1.163798
O  1.078017 -0.73792 0.110968
C  2.441808 -0.442092 -0.092032
C  5.138354 0.386076 -0.534919
C  0.723742 -2.160559 0.346829
C  3.475974 -1.405893 -0.155271
C  2.748876 0.932851 -0.247234
C  4.808279 -0.979766 -0.375457
C  4.07905 1.333483 -0.466038
C  -3.135427 -2.814267 0.093429
C  -0.747382 -2.202496 0.6495
C  -1.659429 -2.809646 -0.156578
C  -3.666798 -0.013802 -0.436276
C  6.570049 0.836289 -0.771664
C  -4.685133 0.684164 0.257209
C  -2.388962 0.574898 -0.593308
C  -4.435056 1.968685 0.793066
C  -2.122366 1.851295 -0.045364
C  -3.151019 2.53171 0.637086
H  1.323811 -2.537267 1.201858
H  0.965226 -2.761565 -0.553481
H  3.267906 -2.474122 -0.043293
H  1.93551 1.663554 -0.190488
H  5.603315 -1.733779 -0.424281
H  4.302043 2.401102 -0.584394
H  -3.599737 -3.796983 -0.096077
H  -3.403271 -2.466269 1.103355
H  -1.072342 -1.681956 1.560254
H  -1.322105 -3.295626 -1.083747
H  6.667984 1.38729 -1.726225
H  6.919129 1.513652 0.030746
H  7.262599 -0.022352 -0.808783
H  -5.672719 0.227313 0.375553
H  -1.59679 0.048665 -1.13207
H  -5.223526 2.511579 1.32184
H  -1.130563 2.297728 -0.157155
