program: Gaussian 09
title: 000027936
version: EM64L-G09RevD.01
frameworkgroup: C1[X(C15H14N2)]
method: RPBEPBE
basis: SDD
operation: Freq
keyword: #pfreq=noraman
keyword: PBEPBE/SDD
title: #p freq=noraman PBEPBE/SDD
converged: YES YES NO NO
title: Mulliken charges:
elementType: N N C C C C C C C C C C C C C C C H H H H H H H H H H H H H H
charge: -0.164127 -0.004428 -0.444665 0.273166 -0.564503 0.277528 -0.210258 -0.426910 0.518130 -0.344798 -0.400823 -0.232403 -0.244831 -0.350255 -0.347918 -0.328657 -0.327960 0.243140 0.239102 0.244900 0.233451 0.248945 0.254860 0.229253 0.238787 0.220378 0.221593 0.234892 0.233808 0.240159 0.240440
chargesum: 0.00000
title: Mulliken charges with hydrogens summed into heavy atoms:
elementType: N N C C C C C C C C C C C C C C C
charge: -0.164127 -0.004428 0.037577 0.273166 -0.086151 0.277528 0.038687 -0.172050 0.518130 -0.115544 -0.162036 -0.012025 -0.023239 -0.115363 -0.114110 -0.088498 -0.087520
polarizability: 2.38724121e+02 -1.20571915e+01 1.91433312e+02 -1.87697787e+01 -4.25816556e+00 8.20533596e+01
1716.lowfreq: -6.7673 -6.0068 -0.0007 -0.0007 -0.0002 7.7865 17.9029 27.0820 46.8968
frequency: 17.8387 26.9156 46.8806 64.3559 96.7759 191.7696 216.1884 253.1089 259.6014 338.2484 341.3644 368.9364 423.5810 461.3173 515.9178 523.7907 554.4241 576.7485 591.2061 617.3902 663.5344 726.1997 729.8286 748.8933 750.5413 755.9638 774.1686 798.9193 807.2859 846.9381 849.7643 858.5706 873.8103 887.5244 931.6982 960.4614 963.1720 972.0983 976.6138 991.0014 1007.9534 1012.4956 1041.0667 1061.7896 1081.9250 1091.8899 1126.5659 1159.3880 1169.0882 1206.9674 1216.6950 1228.0766 1239.3371 1278.6900 1294.1969 1310.5871 1317.8437 1336.9669 1349.5993 1360.6091 1368.7449 1404.5081 1417.5252 1460.3546 1466.6742 1468.1104 1479.4539 1490.0666 1513.4695 1557.4313 1582.4444 1588.3414 1624.3655 3001.1184 3010.0996 3053.9739 3078.8964 3122.5807 3122.8523 3123.5937 3131.2096 3143.6411 3145.0697 3150.6334 3162.4596 3203.9380 3231.2927
redmass: 3.8977 4.7073 4.8542 3.3145 5.9688 4.3464 4.1196 3.5770 3.1211 4.8497 2.6189 2.4838 2.8305 3.2834 3.7069 6.0306 5.5935 3.7410 3.6550 5.0669 6.9220 3.9130 1.4933 1.5155 3.5708 3.5165 2.2453 1.2628 1.7595 1.7680 1.8661 1.4521 4.8931 1.2489 1.3828 4.5042 1.5918 1.3035 1.4951 1.9363 4.3694 2.1774 1.6589 2.1863 1.8366 1.6307 1.3560 1.3065 1.2170 1.7345 1.4237 2.0781 1.6607 1.4197 1.4206 5.4864 2.4233 1.2844 1.6596 1.5278 3.3271 2.0145 3.6780 2.2514 2.0019 2.8837 1.3559 1.1856 4.1542 6.7496 6.6446 5.7308 7.3348 1.0600 1.0597 1.1022 1.1057 1.0861 1.0859 1.0881 1.0888 1.0960 1.0953 1.0996 1.1002 1.0903 1.1063
irintensity: 0.1558 1.1231 0.5511 0.2660 1.4988 1.5141 5.9352 0.4520 0.6823 1.0383 0.1406 0.0055 10.2489 5.1797 28.6575 5.3939 8.6037 3.0654 1.4010 1.2894 0.6155 11.4967 7.0802 111.1329 14.0991 2.6186 35.3336 2.3983 33.7020 13.7682 8.2929 7.2671 5.6220 0.0245 3.8856 3.7447 0.4026 0.1930 0.0013 2.3920 18.3511 12.5413 5.5006 4.0361 6.1803 0.9830 5.3653 19.7105 13.5227 11.9237 2.4640 0.9446 27.4783 0.2577 7.6015 1.6418 74.1541 2.4352 33.1530 11.3808 26.1081 16.6761 16.6426 66.1925 3.0118 8.4420 13.9487 20.3075 33.9275 13.5699 0.6256 72.5881 4.8667 3.4843 49.5167 0.3775 17.2878 8.0060 0.4032 11.6986 6.3958 52.5999 42.4801 0.8244 29.0803 0.2823 4.5760
temp: 298.150 k
press: 1.00000 atm
elementType: 7 7 6 6 6 6 6 6 6 6 6 6 6 6 6 6 6 1 1 1 1 1 1 1 1 1 1 1 1 1 1
symmnumber: 1
zpe: 660027.2 jmol-1
zpe.correction: 0.251391 hartree
zpe.thermalcorrener: 0.265051 hartree
zpe.thermalcorrenthalpy: 0.265995 hartree
zpe.thermalcorrgfe: 0.208177 hartree
zpe.sumelectzpe: -688.310143 hartree
zpe.sumelectthermal: -688.296483 hartree
zpe.sumelectthermalent: -688.295539 hartree
zpe.sumelectthermalfe: -688.353357 hartree
dipole: -0.6882 -1.0197 0.2687
dipole: 1.2592
quadrupole: -120.7077 -86.4860 -105.9689
quadrupole: -4.6736 -0.4467 -0.9342
quadrupole: -16.3201 17.9015 -1.5814 -4.6736 -0.4467 -0.9342
hfenergy: -688.5615337 hartree
pointgroup: C01 [X(C15H14N2)]
dipole: 0.2679894 -0.4039837 -0.1019943 debye
polarizability: 238.6529969|11.571019|191.3946972|-19.7183224|2.9101723|82.1630979 unknown
InChI: InChI=1S/C15H14N2/c1-2-4-15-14(3-1)8-12-17(15)11-7-13-5-9-16-10-6-13/h1-6,8-10,12H,7,11H2
charge 0 multiplicity 1
31 atoms
N  1.073697 -0.907785 0.42688
N  -5.322091 0.545867 0.253226
C  -0.34372 -0.61725 0.653708
C  2.080082 0.047681 0.207738
C  -1.121888 -0.327105 -0.668702
C  3.304476 -0.663258 -0.066878
C  1.63749 -2.187825 0.280611
C  2.993908 -2.077406 -0.014576
C  -2.580602 -0.020773 -0.387398
C  2.018679 1.459773 0.238632
C  4.490382 0.078589 -0.313319
C  3.211521 2.168627 -0.010311
C  4.433936 1.485393 -0.284404
C  -3.558127 -1.047557 -0.340729
C  -3.017964 1.298602 -0.103885
C  -4.896186 -0.723649 -0.022378
C  -4.376596 1.532199 0.206126
H  -0.432851 0.252468 1.331032
H  -0.804349 -1.47851 1.169984
H  -0.637679 0.523638 -1.181864
H  -1.02765 -1.208559 -1.328984
H  1.022307 -3.077517 0.412256
H  3.684169 -2.905273 -0.166498
H  1.086655 1.994903 0.45222
H  5.434664 -0.436442 -0.522306
H  3.200789 3.264211 0.007352
H  5.340611 2.07077 -0.473674
H  -3.285987 -2.086798 -0.559512
H  -2.313841 2.138483 -0.134838
H  -5.667504 -1.501608 0.013952
H  -4.735432 2.544708 0.424038
