program: Gaussian 09
title: 000291136
version: EM64L-G09RevD.01
frameworkgroup: C1[X(C13H11N3O3S)]
method: RPBEPBE
basis: SDD
operation: Freq
keyword: #p
keyword: freq=noraman
keyword: PBEPBE/SDD
title: #p freq=noraman PBEPBE/SDD
converged: YES YES NO NO
title: Mulliken charges:
elementType: S O O O N N N C C C C C C C C C C C C C H H H H H H H H H H H
charge: 0.325270 -0.249435 -0.197307 -0.191014 -0.433358 0.020308 0.006709 0.524475 -0.478650 -0.229741 -0.188959 -0.355438 0.357438 -0.249247 -0.213045 -0.093657 0.218058 -0.389557 -0.349634 -0.797368 0.261372 0.317720 0.319886 0.239866 0.236042 0.276836 0.298941 0.258908 0.243762 0.269436 0.241382
chargesum: 0.00000
title: Mulliken charges with hydrogens summed into heavy atoms:
elementType: S O O O N N N C C C C C C C C C C C C C
charge: 0.325270 -0.249435 -0.197307 -0.191014 -0.113472 0.020308 0.006709 0.524475 -0.478650 -0.229741 0.072413 -0.037718 0.357438 -0.009381 0.022997 0.183179 0.218058 -0.090616 -0.090726 -0.042788
polarizability: 2.61827669e+02 -2.69071804e+01 1.80999787e+02 4.46588457e+00 -2.77793135e+00 1.58904954e+02
1716.lowfreq: -58.5221 -8.4384 -5.9403 -2.5716 -0.0022 -0.0016 -0.0011 16.7114 23.3336
frequency: -58.5148 16.6279 23.3032 53.8397 66.4190 78.5962 89.8940 115.6797 147.3120 164.9535 180.2867 207.2956 247.7728 281.0399 288.7761 331.9635 347.9327 384.5107 391.2989 425.3857 431.2491 483.6090 516.5695 522.1924 530.4713 545.4129 586.4675 639.2501 661.7720 676.6941 682.4011 688.7569 716.8929 741.0995 751.0090 773.9299 792.7636 821.6337 851.6499 893.5937 933.0812 944.7260 963.6311 979.9459 987.4806 1006.2622 1007.0122 1016.8289 1033.8578 1044.8591 1058.3286 1113.8801 1125.9540 1173.2236 1183.8611 1203.8562 1221.4491 1241.9810 1259.6643 1299.9977 1324.5404 1352.6067 1360.7470 1380.3983 1393.2246 1421.2653 1435.7954 1441.8737 1456.4839 1467.1175 1505.4452 1521.6740 1544.7620 1578.5851 1599.8677 1636.5354 2990.8648 3075.5224 3138.9008 3139.7712 3148.8542 3150.0213 3168.3454 3170.9903 3174.7715 3192.5023 3447.1424
redmass: 1.0402 8.0510 7.7138 5.8005 10.4037 5.7302 3.7622 4.5635 6.8108 7.6244 4.5322 6.5990 11.1980 7.4460 4.7947 4.4056 10.3283 3.8970 5.0534 9.4297 6.4658 4.9626 5.1300 5.3374 4.4164 4.2969 3.0387 5.9175 7.3341 7.6378 8.5339 7.3089 1.3466 4.4001 2.7581 1.2859 10.1678 4.5200 1.3117 1.3599 6.4617 1.4309 1.3687 1.4409 1.6939 1.3697 5.0287 4.9745 1.6698 2.0098 5.4681 2.3900 1.7115 1.0669 2.4039 4.8044 3.1808 1.5352 1.5955 1.8960 6.6460 4.0868 6.0187 1.2487 2.5317 2.3149 1.9924 1.7104 1.4164 1.0463 2.1821 8.4399 5.8308 5.1363 6.4309 5.1118 1.0385 1.0981 1.0982 1.0864 1.0893 1.0917 1.0918 1.0987 1.0963 1.0955 1.0765
irintensity: 0.2688 0.7121 1.0781 4.1594 1.3658 5.0220 0.2540 0.3935 3.9876 4.4790 0.4094 5.2472 0.2958 4.2134 2.9750 1.8293 1.4849 0.3463 1.0524 7.1944 7.5983 8.4907 16.8991 7.4216 12.5056 2.4027 0.1435 3.7790 12.8168 0.4579 13.0038 4.4382 36.7122 8.2938 3.4934 104.6426 19.1959 2.8177 21.8122 4.2356 8.1602 7.6878 4.1091 0.0394 21.6233 4.2708 3.7350 9.5939 7.3113 7.3616 43.6252 1.1055 3.6113 3.0271 66.4487 194.5234 71.6603 1.6518 9.1408 74.3078 27.3004 84.9283 158.9164 61.9919 35.5869 141.5246 71.0282 11.1875 40.0347 21.0195 392.5441 41.1753 137.6103 68.9430 54.6257 110.9486 4.6605 11.0036 7.0630 2.5452 4.3948 12.9768 3.1704 15.6692 3.9060 10.4700 72.6819
temp: 298.150 k
press: 1.00000 atm
elementType: 16 8 8 8 7 7 7 6 6 6 6 6 6 6 6 6 6 6 6 6 1 1 1 1 1 1 1 1 1 1 1
symmnumber: 1
zpe: 581198.5 jmol-1
zpe.correction: 0.221367 hartree
zpe.thermalcorrener: 0.238759 hartree
zpe.thermalcorrenthalpy: 0.239703 hartree
zpe.thermalcorrgfe: 0.173498 hartree
zpe.sumelectzpe: -1288.472857 hartree
zpe.sumelectthermal: -1288.455465 hartree
zpe.sumelectthermalent: -1288.454521 hartree
zpe.sumelectthermalfe: -1288.520726 hartree
dipole: 2.3056 -1.6808 0.9862
dipole: 3.0188
quadrupole: -149.2057 -109.1485 -133.6962
quadrupole: -6.1781 -6.2536 -1.3471
quadrupole: -18.5222 21.5350 -3.0127 -6.1781 -6.2536 -1.3471
hfenergy: -1288.6942236 hartree
pointgroup: C01 [X(C13H11N3O3S1)]
dipole: -0.6717894 0.6259174 0.7533739 debye
polarizability: 240.0504|-38.0606114|190.4411631|-23.9375768|20.1253085|171.2408473 unknown
InChI: InChI=1S/C13H11N3O3S/c1-9(17)15-10-4-2-3-5-12(10)20-13-6-7-14-8-11(13)16(18)19/h2-8,15H,1H3
charge 0 multiplicity 1
31 atoms
S  0.437864 0.753528 -1.243346
O  -4.33905 -1.332586 0.203242
O  4.22717 -1.594897 -1.969993
O  2.462837 -0.319067 -2.653209
N  -2.241126 -0.603402 -0.56996
N  3.138504 -0.943239 -1.738367
N  2.985971 -1.651491 1.938185
C  -2.127706 0.672885 0.031173
C  -0.916809 1.412588 -0.152132
C  1.431769 -0.193392 -0.013494
C  -0.766588 2.702802 0.398487
C  -3.167908 1.255761 0.80976
C  2.619672 -0.900911 -0.36045
C  -1.805288 3.27485 1.165412
C  -2.996345 2.539533 1.366405
C  1.057975 -0.247251 1.354329
C  -3.294865 -1.525736 -0.482296
C  3.352878 -1.603619 0.634148
C  1.842609 -0.970495 2.272143
C  -3.058792 -2.795068 -1.297067
H  0.165015 3.250927 0.224431
H  -4.08785 0.68806 0.959497
H  -1.447564 -0.864712 -1.167745
H  -1.685399 4.275022 1.592983
H  -3.810214 2.970756 1.959564
H  0.163853 0.277352 1.70085
H  4.262218 -2.1366 0.341143
H  1.553724 -1.013909 3.327561
H  -2.930937 -2.564259 -2.370808
H  -3.928309 -3.456631 -1.177533
H  -2.15401 -3.3299 -0.953616
