program: Gaussian 09
title: 000291107
version: EM64L-G09RevD.01
frameworkgroup: C1[X(C10H16O)]
method: RPBEPBE
basis: SDD
operation: Freq
keyword: #pfreq=noraman
keyword: PBEPBE/SDD
title: #p freq=noraman PBEPBE/SDD
converged: NO NO NO NO
title: Mulliken charges:
elementType: O C C C C C C C C C C H H H H H H H H H H H H H H H H
charge: -0.255111 -0.072159 -0.072089 -0.160983 -0.160981 -0.462382 -0.462373 -0.472972 -0.473015 -0.402963 -0.402932 0.204729 0.204706 0.240574 0.240564 0.234514 0.203307 0.203308 0.234513 0.190186 0.200151 0.200150 0.190199 0.195004 0.230552 0.230487 0.195014
chargesum: 0.00000
title: Mulliken charges with hydrogens summed into heavy atoms:
elementType: O C C C C C C C C C C
charge: -0.255111 0.132570 0.132618 0.079591 0.079584 -0.024561 -0.024552 -0.082635 -0.082666 0.022592 0.022570
polarizability: 1.09905022e+02 2.41321705e-04 9.96325229e+01 1.17240160e+00 -5.27261095e-04 8.68760091e+01
1716.lowfreq: -8.8121 -0.0005 -0.0004 0.0004 18.6085 21.0564 92.3301 133.2424 169.1713
frequency: 92.2524 132.6781 169.1709 249.4099 311.3097 327.8103 364.5911 436.4023 468.1854 536.6557 588.7074 699.7842 729.0241 755.9157 761.6043 774.0317 808.2601 837.4726 843.0589 860.1488 877.8438 910.1540 938.8876 938.9863 958.2787 984.2221 991.5424 1012.9665 1017.3221 1058.9153 1086.4341 1092.3558 1109.8015 1126.7550 1141.7656 1169.2112 1191.1502 1201.6744 1202.9419 1222.9391 1231.6062 1238.0184 1250.8812 1272.9606 1283.5126 1290.7673 1305.0985 1319.3895 1323.9740 1330.1017 1340.9983 1354.5618 1366.6444 1459.4623 1464.7933 1464.9604 1479.0919 1480.6240 1488.3425 2962.2370 2968.5656 2980.4689 2994.9944 2997.9404 3008.6360 3009.9964 3016.2794 3018.6038 3023.7498 3037.4149 3061.6180 3065.9677 3087.4921 3088.5989 3096.7409
redmass: 2.7385 1.7842 3.4093 2.0005 2.6263 2.1675 2.4963 3.7491 3.5219 2.4143 3.7328 3.2674 2.9255 3.4425 1.9020 2.3886 2.0745 2.2873 2.4073 2.1404 2.8135 4.2553 2.1286 1.9200 3.5151 1.9130 2.6510 2.3727 1.5205 1.7305 1.5357 1.7933 1.5122 1.2975 1.2661 1.2837 1.2561 1.2715 1.5993 1.3974 1.5277 1.2255 1.3021 1.4393 1.3231 1.4746 1.5650 1.5842 1.3846 1.4240 1.3514 1.4377 1.3818 1.0764 1.0838 1.0876 1.0907 1.0893 1.0841 1.0611 1.0608 1.0628 1.0828 1.0660 1.0594 1.1003 1.0826 1.0984 1.0662 1.0999 1.1020 1.1046 1.0886 1.1032 1.0960
irintensity: 0.4911 0.0282 1.8007 0.0239 0.8280 0.0146 0.3721 0.0137 3.5219 0.5683 15.0733 0.3677 1.3069 0.3239 10.7372 12.8638 7.6987 1.6350 4.9456 18.4107 7.2020 4.1535 3.2129 9.1423 12.7910 7.7195 1.9646 0.7708 0.0963 1.2779 6.3451 4.5511 1.1426 8.3209 0.6920 2.1583 1.9142 0.0103 10.9052 0.7765 2.9025 0.3717 0.0198 1.4324 0.4978 3.9448 0.4136 0.2144 1.9731 0.3456 3.1869 0.0915 0.1065 0.2310 2.9285 13.1135 3.5512 24.1266 8.6363 17.8007 36.2761 33.7837 31.0907 100.0036 52.4414 45.5607 40.6430 12.8902 79.9580 5.5608 80.6685 2.4455 60.1297 35.9367 29.4252
temp: 298.150 k
press: 1.00000 atm
elementType: 8 6 6 6 6 6 6 6 6 6 6 1 1 1 1 1 1 1 1 1 1 1 1 1 1 1 1
symmnumber: 1
zpe: 634892.4 jmol-1
zpe.correction: 0.241818 hartree
zpe.thermalcorrener: 0.250763 hartree
zpe.thermalcorrenthalpy: 0.251708 hartree
zpe.thermalcorrgfe: 0.208187 hartree
zpe.sumelectzpe: -464.999788 hartree
zpe.sumelectthermal: -464.990843 hartree
zpe.sumelectthermalent: -464.989898 hartree
zpe.sumelectthermalfe: -465.033419 hartree
dipole: 0.4909 0.0002 1.8764
dipole: 1.9395
quadrupole: -66.2181 -64.5449 -70.5260
quadrupole: -0.0002 0.8268 -0.0004
quadrupole: 0.8782 2.5514 -3.4296 -0.0002 0.8268 -0.0004
hfenergy: -465.241606 hartree
pointgroup: C01 [X(C10H16O1)]
dipole: -0.188551 0.0001261 -0.7394138 debye
polarizability: 109.8896062|-0.0010301|99.6325229|1.3150234|0.0009553|86.8914244 unknown
InChI: InChI=1S/C10H16O/c1-2-4-8-7(3-1)9-5-6-10(8)11-9/h7-10H,1-6H2
charge 0 multiplicity 1
27 atoms
O  -0.693132 -0.000029 1.311644
C  0.048937 -0.793512 -0.821597
C  0.049084 0.793778 -0.821422
C  -0.95399 -1.101167 0.337227
C  -0.953784 1.101368 0.337475
C  -2.407677 -0.786452 -0.127891
C  -2.407534 0.787027 -0.12771
C  1.464394 -1.380892 -0.612758
C  1.464662 1.380851 -0.612564
C  2.202333 -0.782713 0.612582
C  2.202799 0.782296 0.612496
H  -0.358794 -1.18311 -1.77403
H  -0.358616 1.183649 -1.773757
H  -0.810075 -2.067182 0.844282
H  -0.809684 2.067244 0.844741
H  -3.139919 -1.185663 0.59449
H  -2.630203 -1.217725 -1.120352
H  -2.630011 1.21857 -1.120064
H  -3.139685 1.186193 0.594788
H  2.061604 -1.196591 -1.529007
H  1.395498 -2.482753 -0.506273
H  1.395978 2.482701 -0.505826
H  2.061695 1.196666 -1.52895
H  3.239897 -1.169541 0.62722
H  1.715093 -1.142231 1.536587
H  1.716324 1.14222 1.53675
H  3.240608 1.168498 0.626517
