program: Gaussian 09
title: 000291138
version: EM64L-G09RevD.01
frameworkgroup: C1[X(C14H23O3P)]
method: RPBEPBE
basis: SDD
operation: Freq
keyword: #p
keyword: freq=noraman
keyword: PBEPBE/SDD
title: #p freq=noraman PBEPBE/SDD
converged: YES YES NO NO
title: Mulliken charges:
elementType: P O O O C C C C C C C C C C C C C C H H H H H H H H H H H H H H H H H H H H H H H
charge: 1.051050 -0.534754 -0.547417 -0.577467 -0.327953 -0.351317 -0.344271 -0.348527 -0.309617 -0.261732 -0.682009 -0.683471 0.305008 -0.363953 -0.328132 -0.194134 -0.200191 -0.250881 0.200725 0.204821 0.207264 0.201933 0.194399 0.195204 0.197485 0.193839 0.194713 0.224804 0.228210 0.218170 0.211757 0.217445 0.213272 0.210500 0.216218 0.212248 0.250642 0.276877 0.226935 0.225308 0.226997
chargesum: 0.00000
title: Mulliken charges with hydrogens summed into heavy atoms:
elementType: P O O O C C C C C C C C C C C C C C
charge: 1.051050 -0.534754 -0.547417 -0.577467 0.077593 0.057880 0.045331 0.042798 0.109899 0.184649 -0.039534 -0.044505 0.305008 -0.113311 -0.051255 0.032802 0.025117 -0.023884
polarizability: 2.30479557e+02 2.10979003e+01 2.01932590e+02 -1.67540191e+01 1.24307477e+01 1.42467070e+02
1716.lowfreq: -12.6433 -8.6247 -6.5640 0.0010 0.0018 0.0023 1.3733 7.1370 19.2528
frequency: -12.3130 4.0667 18.4038 26.9026 34.8139 49.9251 67.5494 77.6689 91.5517 98.6998 103.3537 115.4521 145.4732 171.4594 188.3557 206.5556 230.3015 234.6429 246.9367 273.5505 323.5618 338.6359 376.6604 403.3184 412.7601 428.3148 457.8938 499.6797 542.1037 593.6263 607.8950 629.3939 691.5336 694.4244 740.7431 743.4760 764.3651 797.6534 798.9477 822.1060 839.5613 897.3168 898.1916 913.6347 924.3732 929.4985 932.8655 942.7709 970.3184 986.6771 987.9553 1019.8124 1032.0336 1036.8756 1070.3815 1071.4327 1079.5937 1113.0074 1117.6339 1140.7089 1152.6728 1161.4674 1168.3762 1192.5374 1208.2854 1219.1058 1266.4147 1267.3616 1270.3454 1281.1790 1283.2664 1286.5626 1304.3634 1339.1629 1344.8754 1362.7859 1363.2485 1377.6524 1389.1253 1391.2945 1437.6353 1463.9845 1468.5919 1469.2711 1470.7730 1473.6774 1475.9485 1477.5965 1478.5031 1483.2262 1488.4069 1491.0075 1590.0055 1599.5196 2961.8500 2967.2161 2968.7135 2974.5044 2976.2383 2981.6211 2989.9277 2999.0008 3009.7617 3012.3764 3036.3469 3044.9401 3062.0653 3069.8775 3074.3721 3074.7232 3076.2384 3079.5914 3125.9026 3135.9416 3155.1974 3168.0315 3175.7232
redmass: 3.1403 4.0403 3.0670 3.9702 2.5550 2.2334 2.2271 3.7755 3.6471 3.2324 2.2149 2.2369 3.7769 3.7557 4.3654 2.7969 1.2718 1.1855 5.1421 5.2451 4.0900 5.9478 4.4717 3.7862 2.9423 3.6867 5.2696 4.7006 5.0891 9.2271 6.7980 9.0685 9.6526 2.2567 1.0704 1.0707 1.5782 1.1502 1.1326 6.6404 1.2556 1.8478 1.8045 1.4747 5.2294 1.2436 1.3717 3.6612 1.3601 6.2688 1.2975 2.0902 3.8509 3.5103 1.5245 2.3741 2.2213 2.4336 2.5381 1.4170 1.5972 1.4036 1.0713 2.2923 1.3942 1.3326 1.2736 1.2764 1.1705 1.1467 1.0851 1.0823 1.3417 1.3842 1.4179 1.4413 1.3893 8.3153 1.2128 1.2130 2.2718 1.0795 1.6101 1.2934 1.0900 1.0668 1.0428 1.0426 1.0632 1.0715 1.0863 1.0904 6.5808 6.1464 1.0639 1.0594 1.0582 1.0368 1.0374 1.0600 1.0595 1.0572 1.0993 1.1001 1.0987 1.1028 1.1036 1.1027 1.0994 1.1012 1.0995 1.1066 1.0849 1.0898 1.0943 1.0967 1.0980
irintensity: 0.0913 0.1730 0.0087 0.3608 0.2347 1.4792 0.1948 1.8802 0.6132 0.2299 0.0486 1.1777 1.5886 2.4368 2.7888 7.3341 1.5185 0.6907 0.1346 8.5619 1.9167 7.9377 3.5230 7.4603 0.1168 2.6657 23.4896 30.6845 10.6887 111.5030 10.8786 56.2042 100.0687 33.3740 8.2770 8.7058 86.1906 0.8894 1.1563 141.3125 4.0656 45.3671 14.3229 7.3199 288.8168 7.0815 33.3677 88.3738 0.9110 0.1678 1.6913 16.9020 46.9684 23.5019 11.2192 5.3081 5.7779 5.7057 6.2957 6.2292 7.2346 70.7945 4.8283 155.3443 0.5704 0.4791 2.3807 2.5940 0.7645 0.4161 0.1198 0.8795 0.7337 0.3059 1.0577 10.8071 30.2594 0.2755 7.6407 9.5074 3.6928 1.1072 78.3955 39.3725 7.0248 1.6015 13.3331 12.5301 5.0277 5.0182 19.3939 19.7314 9.2163 67.6172 19.6304 36.7539 27.0879 37.7756 28.9872 63.3396 20.4949 48.7076 6.9850 6.6430 11.1929 3.6226 18.9765 14.5819 38.7760 108.4975 53.8400 107.9087 0.7988 17.8125 30.8897 12.4644 5.7620
temp: 298.150 k
press: 1.00000 atm
elementType: 15 8 8 8 6 6 6 6 6 6 6 6 6 6 6 6 6 6 1 1 1 1 1 1 1 1 1 1 1 1 1 1 1 1 1 1 1 1 1 1 1
symmnumber: 1
zpe: 900643.2 jmol-1
zpe.correction: 0.343037 hartree
zpe.thermalcorrener: 0.364130 hartree
zpe.thermalcorrenthalpy: 0.365074 hartree
zpe.thermalcorrgfe: 0.287492 hartree
zpe.sumelectzpe: -1112.777607 hartree
zpe.sumelectthermal: -1112.756514 hartree
zpe.sumelectthermalent: -1112.755570 hartree
zpe.sumelectthermalfe: -1112.833151 hartree
dipole: -0.8669 1.8753 0.6735
dipole: 2.1730
quadrupole: -108.5854 -108.2004 -118.2092
quadrupole: 0.1132 1.0903 3.3554
quadrupole: 3.0796 3.4646 -6.5442 0.1132 1.0903 3.3554
hfenergy: -1113.1206434 hartree
pointgroup: C01 [X(C14H23O3P1)]
dipole: -0.2410382 -0.7621249 -0.3032414 debye
polarizability: 233.5901733|-18.4513791|196.3461961|18.2834746|15.5087513|144.942848 unknown
InChI: InChI=1S/C14H23O3P/c1-3-5-12-15-18(16-13-6-4-2)17-14-10-8-7-9-11-14/h7-11H,3-6,12-13H2,1-2H3
charge 0 multiplicity 1
41 atoms
P  0.418214 -0.353403 1.338763
O  0.204075 -1.218185 -0.216272
O  2.133068 -0.169166 1.423305
O  0.095448 1.272305 0.659025
C  -1.56647 -2.979393 -0.100699
C  4.411675 0.102475 0.621923
C  -1.860762 -4.49807 -0.126536
C  5.358456 0.604865 -0.494968
C  -0.060843 -2.679505 -0.136025
C  2.940819 0.326203 0.266693
C  -3.373014 -4.80698 -0.085134
C  6.846316 0.381062 -0.147703
C  -1.195944 1.720208 0.289638
C  -1.719707 2.844889 0.969397
C  -1.905861 1.119921 -0.778574
C  -2.970682 3.37095 0.576766
C  -3.160257 1.651617 -1.153377
C  -3.697372 2.774964 -0.481435
H  -2.011608 -2.527817 0.808867
H  -2.048928 -2.489949 -0.969033
H  4.636304 0.628601 1.569646
H  4.581964 -0.976253 0.804154
H  -1.360805 -4.987522 0.734318
H  -1.417503 -4.943723 -1.040394
H  5.178283 1.684208 -0.673824
H  5.118334 0.086046 -1.445407
H  0.446635 -3.121272 0.747632
H  0.405511 -3.101784 -1.044215
H  2.710512 1.396884 0.120116
H  2.646082 -0.233676 -0.641505
H  -3.894239 -4.352059 -0.948165
H  -3.562174 -5.895641 -0.110869
H  -3.834879 -4.404448 0.835675
H  7.059824 -0.693414 0.006114
H  7.507999 0.746093 -0.954444
H  7.119984 0.913712 0.782322
H  -1.141587 3.290562 1.785055
H  -1.464146 0.262664 -1.295104
H  -3.377239 4.244243 1.099272
H  -3.713888 1.192133 -1.980291
H  -4.667997 3.184654 -0.781405
