program: Gaussian 09
title: 000291116
version: EM64L-G09RevD.01
frameworkgroup: C1[X(C16H24OS)]
method: RPBEPBE
basis: SDD
operation: Freq
keyword: #p
keyword: freq=noraman
keyword: PBEPBE/SDD
title: #p freq=noraman PBEPBE/SDD
converged: YES YES NO NO
title: Mulliken charges:
elementType: S O C C C C C C C C C C C C C C C C H H H H H H H H H H H H H H H H H H H H H H H H
charge: 0.598807 -0.616678 0.046150 0.328123 -0.485370 -0.476273 -0.387607 -0.467985 -0.433284 -0.745648 -0.756446 -0.748740 -0.131335 -0.253368 -0.249144 -0.211870 -0.215614 -0.228209 0.169236 0.236258 0.217448 0.216157 0.215050 0.294979 0.216793 0.278340 0.208915 0.217183 0.212967 0.210357 0.208578 0.227268 0.217860 0.207416 0.208326 0.208259 0.222160 0.306783 0.235238 0.235150 0.231985 0.231784
chargesum: 0.00000
title: Mulliken charges with hydrogens summed into heavy atoms:
elementType: S O C C C C C C C C C C C C C C C C
charge: 0.598807 -0.616678 0.215387 0.328123 -0.031664 -0.045066 -0.092628 0.027147 -0.007186 -0.113746 -0.103903 -0.109995 -0.131335 0.053414 -0.013906 0.023280 0.016372 0.003575
polarizability: 2.64611161e+02 -4.25082936e+00 1.83832667e+02 2.72790532e+00 3.53008591e-01 1.35982012e+02
1716.lowfreq: -16.0980 -9.1175 -0.0012 -0.0012 -0.0011 5.4905 22.7190 32.4680 35.7960
frequency: 13.6750 27.8554 35.5375 52.3420 71.9466 136.8903 142.6645 168.5292 181.2561 207.0127 229.4264 234.3943 244.8330 262.7689 270.0438 283.9761 307.8746 324.2824 341.7849 370.5908 378.5698 403.3170 415.8601 425.3117 432.1844 458.7126 463.4049 486.4646 515.4796 606.1883 649.5243 660.6567 701.2020 752.9292 758.1070 773.7436 791.7273 808.7996 850.1083 856.3436 912.0097 914.0046 918.5675 922.8285 926.6691 930.1428 936.7250 980.0646 984.4282 988.6087 1006.1943 1010.2590 1012.5598 1018.4033 1043.6617 1050.3901 1072.9081 1078.5294 1081.9322 1103.1498 1148.2418 1162.0922 1169.3292 1175.1223 1182.6378 1191.3475 1228.4508 1238.3706 1247.4726 1277.3861 1295.9565 1298.5038 1308.8593 1322.5100 1333.2826 1340.6750 1348.0686 1370.4720 1374.2886 1377.5454 1382.1523 1402.3166 1429.2228 1430.7934 1451.8528 1455.2408 1458.8827 1465.1838 1466.4731 1472.3357 1477.9386 1485.4938 1489.0502 1498.7849 1582.7175 1597.5622 2914.8356 2954.3092 2961.8038 2965.1446 2969.2211 2976.4785 2980.2054 2987.6977 3010.4566 3019.4379 3047.7375 3050.2600 3054.6445 3055.5904 3060.5112 3065.3448 3069.7423 3076.5934 3080.0923 3117.0345 3124.1361 3135.1065 3148.2809 3164.9341
redmass: 4.6821 2.7504 4.1521 3.9152 5.0782 2.8668 3.5327 4.5116 1.5917 4.2125 1.4027 1.4117 2.3172 1.3894 2.5762 3.2510 2.7717 2.3041 2.2084 2.6484 2.3307 2.9107 4.7396 5.1251 2.6510 3.3334 2.5691 3.2828 2.4429 6.4768 4.8523 3.8933 2.2972 1.7043 2.1308 1.5009 14.9260 2.9390 2.5613 1.2783 1.7503 2.4219 1.6253 1.6633 1.7908 1.3652 1.2360 5.7396 1.3652 1.5727 1.3389 3.6838 1.4252 1.9684 2.0617 1.8195 1.5698 1.5124 1.6771 1.1415 1.4368 2.0579 1.0724 1.1186 1.5046 1.7508 2.3845 2.3518 1.5147 1.3397 1.4184 1.3199 1.3890 1.5539 1.4822 1.4340 1.5004 1.4331 1.2108 1.2039 9.3727 1.2094 2.1223 1.0845 1.5912 1.2736 1.0558 1.0681 1.0521 1.0565 1.0815 1.0538 1.0601 1.0573 5.8399 6.6984 1.0815 1.0616 1.0604 1.0358 1.0359 1.0399 1.0609 1.0630 1.0953 1.0976 1.0997 1.0901 1.0982 1.0995 1.0991 1.0984 1.0982 1.0983 1.0977 1.0885 1.0868 1.0902 1.0956 1.1011
irintensity: 0.6706 0.3186 0.0833 0.8184 0.3201 1.3604 0.4252 5.2656 1.7768 4.8026 1.2761 3.2566 7.2292 0.2899 0.5861 1.3971 0.8564 0.1180 1.5028 0.7119 1.0169 0.2696 10.0708 2.5700 0.0773 0.0719 0.2220 17.8710 0.2634 0.0488 5.5989 5.3635 33.4024 43.0548 44.0358 1.1205 34.3360 4.7090 4.0558 0.2483 1.8268 4.6553 4.8322 0.4060 3.5266 4.4722 0.0709 5.9735 2.1356 21.8191 1.2498 11.4618 0.3055 6.9148 9.1104 0.0159 11.8143 5.1316 2.9239 0.0718 0.4835 0.6192 2.6761 6.0552 0.4277 21.5241 7.5607 19.1173 20.4800 2.1043 0.3802 3.3378 21.4907 0.2482 0.7505 6.8708 3.7034 6.0529 21.0762 29.2917 1.3732 18.1771 15.6458 22.1918 16.2846 21.6678 2.5200 2.8005 2.2038 1.0708 6.6392 9.8288 7.8457 34.5582 14.6919 3.3911 30.0335 27.9408 26.0269 28.4578 41.2812 7.2315 19.3077 25.6879 41.9067 4.4241 32.0026 31.2297 23.7180 2.0790 49.9696 66.6053 76.2661 19.8006 67.7205 6.8567 3.5872 0.6865 27.0841 38.7399
temp: 298.150 k
press: 1.00000 atm
elementType: 16 8 6 6 6 6 6 6 6 6 6 6 6 6 6 6 6 6 1 1 1 1 1 1 1 1 1 1 1 1 1 1 1 1 1 1 1 1 1 1 1 1
symmnumber: 1
zpe: 944538.9 jmol-1
zpe.correction: 0.359756 hartree
zpe.thermalcorrener: 0.379012 hartree
zpe.thermalcorrenthalpy: 0.379956 hartree
zpe.thermalcorrgfe: 0.311082 hartree
zpe.sumelectzpe: -1095.922480 hartree
zpe.sumelectthermal: -1095.903225 hartree
zpe.sumelectthermalent: -1095.902281 hartree
zpe.sumelectthermalfe: -1095.971154 hartree
dipole: -0.3731 3.9146 -1.8986
dipole: 4.3667
quadrupole: -103.9202 -121.0028 -120.5289
quadrupole: -4.6560 2.9657 4.0112
quadrupole: 11.2304 -5.8522 -5.3782 -4.6560 2.9657 4.0112
hfenergy: -1096.2822363 hartree
pointgroup: C01 [X(C16H24O1S1)]
dipole: 0.1603026 1.1393705 1.2757856 debye
polarizability: 264.3104296|-1.4346011|177.2468854|8.4082773|16.1632824|142.8685246 unknown
InChI: InChI=1S/C16H24OS/c1-16(2,3)13-9-11-15(12-10-13)18(17)14-7-5-4-6-8-14/h4-8,13,15H,9-12H2,1-3H3
charge 0 multiplicity 1
42 atoms
S  1.081975 -0.104155 -0.931681
O  1.004271 -1.703681 -1.437542
C  -2.765363 0.227663 0.454742
C  -4.15489 0.420882 -0.268007
C  -2.044463 -1.099912 0.093534
C  -1.774502 1.403251 0.230574
C  0.187239 -0.111222 0.898829
C  -0.745698 -1.319379 0.907134
C  -0.499642 1.245793 1.092483
C  -4.852119 1.704188 0.268394
C  -4.001929 0.539964 -1.809048
C  -5.084336 -0.784374 0.052638
C  2.867066 0.065959 -0.288907
C  3.665175 -1.087454 -0.365749
C  3.357571 1.299384 0.181731
C  5.008437 -1.007229 0.069196
C  4.703402 1.366207 0.616191
C  5.525326 0.215173 0.561194
H  -2.99552 0.194846 1.54611
H  -1.786521 -1.111774 -0.983564
H  -2.708355 -1.965279 0.268997
H  -2.247228 2.371649 0.475165
H  -1.489529 1.445107 -0.839915
H  1.051064 -0.244885 1.572509
H  -0.990955 -1.545872 1.965743
H  -0.200503 -2.191975 0.494383
H  0.208264 2.077141 0.898785
H  -0.77656 1.32252 2.16586
H  -4.306427 2.623961 -0.009057
H  -5.872284 1.788941 -0.15122
H  -4.941731 1.677614 1.371814
H  -3.515244 -0.352247 -2.242593
H  -3.407317 1.42685 -2.094985
H  -4.996777 0.641047 -2.282834
H  -5.152233 -0.956733 1.144428
H  -6.106331 -0.588747 -0.323155
H  -4.732275 -1.71798 -0.420313
H  3.218568 -2.007441 -0.765409
H  2.722227 2.192543 0.207807
H  5.650041 -1.893966 0.019648
H  5.107831 2.31395 0.988583
H  6.567775 0.273475 0.89361
