program: Gaussian 09
title: 000291097
version: EM64L-G09RevD.01
frameworkgroup: C1[X(C12H18O)]
method: RPBEPBE
basis: SDD
operation: Freq
keyword: #pfreq=noraman
keyword: PBEPBE/SDD
title: #p freq=noraman PBEPBE/SDD
converged: NO YES NO NO
title: Mulliken charges:
elementType: O C C C C C C C C C C C C H H H H H H H H H H H H H H H H H H
charge: -0.193271 0.325469 0.198533 -0.198411 -0.565745 -0.475884 -0.568653 0.045654 -0.756455 -0.784863 -0.298728 -0.184258 -0.750267 0.248945 0.250615 0.250376 0.236035 0.213955 0.240596 0.262176 0.210636 0.231255 0.228841 0.227591 0.232116 0.217178 0.224602 0.267633 0.226117 0.217087 0.221127
chargesum: 0.00000
title: Mulliken charges with hydrogens summed into heavy atoms:
elementType: O C C C C C C C C C C C C
charge: -0.193271 0.325469 0.198533 0.050534 -0.064754 -0.025894 -0.065881 0.045654 -0.085724 -0.107978 -0.074126 0.083375 -0.085937
polarizability: 1.50476690e+02 -4.53233768e+00 1.17903410e+02 -4.17618153e+00 3.26109209e+00 1.08172785e+02
1716.lowfreq: -16.5017 -10.5749 -0.0006 0.0006 0.0007 14.7887 42.3205 91.7429 120.9726
frequency: 41.7638 91.7321 120.9431 141.1125 147.9112 196.0596 206.9971 215.0518 258.5369 274.6068 290.2548 313.2151 347.4719 390.9470 401.2894 420.1406 467.0211 511.2226 542.2267 565.5082 610.8184 686.4417 697.3091 760.4484 797.9722 846.0686 871.8807 884.8152 926.7818 927.7722 943.0936 946.0321 957.2189 973.9189 991.1866 997.3755 1028.8507 1034.7558 1047.6014 1053.2812 1092.3669 1113.4924 1131.6201 1160.7038 1179.2619 1201.2065 1214.3951 1231.7024 1240.7523 1268.2713 1289.6366 1298.7513 1298.7957 1302.3343 1325.4255 1382.6739 1392.9619 1400.8193 1437.6011 1459.1853 1460.1231 1467.8025 1472.4280 1475.6936 1484.3710 1490.0307 1501.4108 1654.4709 1683.7439 2960.8348 2976.5287 2979.9372 3004.2619 3011.2031 3016.4735 3036.2453 3041.9026 3054.7405 3058.1894 3061.4711 3066.0346 3066.9539 3067.7935 3078.3529 3080.2258 3086.8119 3132.4218
redmass: 2.3755 3.0776 1.9999 2.8220 1.2390 1.2551 1.4214 1.7312 2.8035 1.9613 2.5061 3.7753 3.7064 2.4257 2.4848 2.6563 3.0873 3.0608 4.1166 3.2183 3.2338 3.4026 3.2256 1.8169 1.4596 2.6193 2.0748 2.4766 2.2457 1.9205 1.4504 2.0858 1.9295 2.0715 1.1054 1.7674 2.0525 1.9955 1.5535 2.1271 1.3138 1.8241 2.1312 1.6785 1.9381 1.7730 1.5750 1.8438 1.7964 1.9886 1.5322 1.5083 1.4917 1.8544 1.6120 1.2101 1.2368 1.1938 1.0812 1.0554 1.0482 1.0586 1.0598 1.0620 1.0678 1.0685 1.0662 11.3986 6.3681 1.0360 1.0366 1.0371 1.0591 1.0610 1.0628 1.0968 1.0888 1.0985 1.0955 1.0983 1.1013 1.0989 1.0981 1.1027 1.0988 1.0977 1.0909
irintensity: 1.0557 2.2816 0.8722 1.3558 0.3240 1.6907 0.4269 0.2671 0.7216 0.7409 1.4827 2.9667 0.7837 0.2812 0.6667 1.5674 1.2989 5.8835 2.5265 1.1702 3.6065 2.2952 1.3619 5.6869 3.9695 3.4412 0.0709 0.0492 4.3890 18.0187 0.6294 7.5324 13.0789 13.4513 44.8924 5.1639 25.8061 8.8908 0.4213 8.2743 0.8192 1.5071 0.5976 4.6177 8.1131 6.8128 7.3731 2.2482 1.1903 6.1380 10.9393 2.5710 2.0450 9.3092 5.8626 17.2669 9.8352 23.6681 21.4427 4.1522 12.7984 15.1853 18.7932 1.4357 3.9262 14.3600 5.5204 162.0542 2.7450 45.4609 21.5909 37.6717 25.4415 11.5811 44.5713 24.7560 24.1390 15.3617 17.2508 11.2721 5.8958 29.2880 55.0876 41.7849 59.7207 21.4097 5.7281
temp: 298.150 k
press: 1.00000 atm
elementType: 8 6 6 6 6 6 6 6 6 6 6 6 6 1 1 1 1 1 1 1 1 1 1 1 1 1 1 1 1 1 1
symmnumber: 1
zpe: 704720.4 jmol-1
zpe.correction: 0.268414 hartree
zpe.thermalcorrener: 0.281919 hartree
zpe.thermalcorrenthalpy: 0.282863 hartree
zpe.thermalcorrgfe: 0.229400 hartree
zpe.sumelectzpe: -542.266777 hartree
zpe.sumelectthermal: -542.253272 hartree
zpe.sumelectthermalent: -542.252327 hartree
zpe.sumelectthermalfe: -542.305790 hartree
dipole: 1.8594 -2.5738 -0.3589
dipole: 3.1954
quadrupole: -75.1762 -86.1340 -78.3678
quadrupole: 3.8214 0.2700 -0.4571
quadrupole: 4.7164 -6.2413 1.5249 3.8214 0.2700 -0.4571
hfenergy: -542.5351903 hartree
pointgroup: C01 [X(C12H18O1)]
dipole: -0.7059097 1.0389054 -0.0536432 debye
polarizability: 148.2859775|-5.7565479|119.045358|9.4152466|-2.1897119|109.2215499 unknown
InChI: InChI=1S/C12H18O/c1-4-6-12-7-5-9(8-10(12)13)11(12,2)3/h4,6,9H,5,7-8H2,1-3H3
charge 0 multiplicity 1
31 atoms
O  0.582328 -2.3952 -0.040308
C  -0.930715 0.828831 0.456077
C  0.192304 0.073095 -0.392288
C  -2.119644 0.03198 -0.20287
C  -0.354201 0.269967 -1.871603
C  -1.914746 0.294002 -1.724361
C  -1.716524 -1.444499 0.050597
C  -0.178512 -1.400234 -0.102932
C  -0.772881 0.607748 1.979642
C  -0.984494 2.353076 0.207759
C  1.611601 0.53531 -0.213331
C  2.654304 -0.165794 0.306012
C  4.054131 0.384376 0.460761
H  -3.120153 0.299455 0.17648
H  0.006809 -0.535492 -2.534625
H  0.041262 1.219611 -2.274549
H  -2.336457 1.26788 -2.028317
H  -2.406258 -0.481595 -2.338253
H  -2.158512 -2.16047 -0.665786
H  -1.975408 -1.80031 1.06441
H  -1.632505 1.042275 2.524299
H  -0.692827 -0.455473 2.265745
H  0.145246 1.108323 2.338427
H  -0.09562 2.8457 0.643033
H  -1.030724 2.628681 -0.859257
H  -1.876423 2.782831 0.70289
H  1.794584 1.569487 -0.55307
H  2.493373 -1.206695 0.614014
H  4.78202 -0.21607 -0.119824
H  4.123509 1.43332 0.118883
H  4.384432 0.343884 1.517642
