program: Gaussian 09
title: 000028102
version: EM64L-G09RevD.01
frameworkgroup: C1[X(C18H28ClNO3)]
method: RPBEPBE
basis: SDD
operation: Freq
keyword: #p
keyword: freq=noraman
keyword: PBEPBE/SDD
title: #p freq=noraman PBEPBE/SDD
converged: YES YES NO NO
title: Mulliken charges:
elementType: Cl O O O N C C C C C C C C C C C C C C C C C C H H H H H H H H H H H H H H H H H H H H H H H H H H H H
charge: -0.082455 -0.275898 -0.297142 -0.219486 -0.112275 -0.172511 0.374842 -0.419028 0.171655 -0.278974 -0.329725 -0.341946 -0.544151 -0.698460 -0.725297 -0.565903 0.383899 0.241021 -0.571867 -0.660300 -0.825215 0.242757 -0.748112 0.227243 0.227629 0.222215 0.207173 0.222289 0.232165 0.232682 0.212456 0.203516 0.258848 0.206872 0.240829 0.213247 0.225065 0.218479 0.204172 0.251410 0.267380 0.262076 0.224694 0.213147 0.212704 0.268120 0.222700 0.230542 0.250849 0.246269 0.249801
chargesum: 0.00000
title: Mulliken charges with hydrogens summed into heavy atoms:
elementType: Cl O O O N C C C C C C C C C C C C C C C C C C
charge: -0.082455 -0.275898 -0.297142 -0.219486 -0.112275 0.054732 0.374842 0.030816 0.171655 0.150488 0.135122 0.074025 -0.285302 -0.037513 -0.077581 -0.314493 0.383899 0.241021 -0.042410 -0.009755 -0.103852 0.242757 -0.001193
polarizability: 2.79521005e+02 -1.05684264e+01 2.36473804e+02 -1.70094060e+00 -2.86331576e+00 1.77585110e+02
1716.lowfreq: -4.7264 0.0006 0.0014 0.0015 2.0322 3.6464 13.7523 15.5726 25.3776
frequency: 13.4829 15.5111 25.3644 36.9239 40.3305 42.4165 48.3942 54.7459 67.6888 81.8108 85.7626 91.8185 97.8848 133.0240 145.1526 148.6755 159.7594 183.7480 199.5737 202.5544 224.4873 230.7730 235.6328 261.7973 269.6131 273.7740 286.8983 307.5923 318.9402 340.2219 364.5543 404.2813 411.5899 429.9024 454.1973 470.8063 479.9888 510.9975 526.0967 558.5542 592.4215 597.8604 645.8914 657.6162 699.8766 727.4875 742.6646 763.6990 769.4505 794.8228 800.0561 812.7100 854.6336 861.2695 885.2973 900.1541 915.0454 954.1817 958.0246 968.8738 990.0674 1006.1732 1010.6095 1037.0521 1039.5618 1047.3241 1049.4350 1065.7920 1077.3172 1087.5487 1096.2664 1101.5910 1116.4405 1119.1324 1132.3814 1162.0101 1169.9727 1183.4978 1200.2079 1222.9599 1236.0608 1253.4981 1254.7880 1279.2087 1283.6987 1294.5766 1296.2250 1304.5592 1326.7791 1336.9009 1359.8841 1368.2850 1370.3129 1381.4591 1384.1434 1385.3703 1389.3762 1392.8697 1395.4329 1400.1893 1450.8625 1453.0979 1453.4794 1461.0563 1463.5330 1466.3694 1468.5586 1471.1539 1473.6925 1481.4785 1484.3211 1484.9817 1486.8539 1488.4561 1490.5411 1501.9604 1583.8651 1623.7039 1670.5072 2883.0982 2920.6910 2940.9426 2955.2930 2973.5797 2976.5321 2980.5470 2983.8117 2992.9056 3008.6463 3023.1895 3025.5758 3046.0649 3061.0941 3062.4983 3064.0217 3064.5098 3072.1497 3076.6557 3077.4062 3088.3523 3090.3487 3092.2335 3096.2540 3144.6161 3148.5289 3151.1040 3165.5522
redmass: 6.5877 4.9700 4.4074 1.5540 2.5424 3.8760 3.6982 3.2618 2.7045 2.3550 3.1252 3.4835 3.3226 2.1559 1.2664 2.5464 1.8892 4.2532 2.5237 3.6139 3.4239 1.3439 1.5462 2.5343 1.2337 2.7624 2.8754 3.7396 3.7000 3.2821 3.3320 3.1994 2.9912 3.8716 3.4882 3.2685 2.9305 3.5650 4.3334 3.0920 5.0209 4.5958 4.9560 5.5049 5.3928 5.9306 3.0000 2.6796 1.4416 1.1454 2.8545 1.1895 1.4580 4.1514 2.6235 1.5414 1.2013 2.2084 1.5230 4.3189 1.9904 1.3818 1.5383 2.8603 1.6587 2.5668 1.5164 2.5940 2.8186 2.0004 2.0186 2.0581 2.8279 1.4886 3.0141 2.2179 1.3737 2.9975 1.8941 1.8696 1.3158 1.4083 1.5081 1.2074 2.3843 1.3067 1.3119 1.3180 1.7575 1.3994 1.3528 1.3316 1.2264 1.5209 1.7348 2.4585 1.2401 1.6926 1.4323 1.5176 1.0938 1.0583 1.0488 1.0588 1.0517 1.0845 1.0459 1.0824 1.0738 1.0843 1.1054 1.1105 1.0788 1.0761 1.0653 2.5335 7.1474 7.5424 9.8299 1.0708 1.0698 1.0677 1.0573 1.0354 1.0358 1.0365 1.0358 1.0828 1.0367 1.1024 1.0894 1.0944 1.0589 1.0979 1.0929 1.0993 1.0993 1.0999 1.0986 1.0994 1.0994 1.1006 1.0973 1.1012 1.1121 1.0904 1.0911
irintensity: 0.5469 0.5173 0.3241 2.0029 0.6264 0.4684 0.0442 0.2602 1.1710 1.6143 1.9171 0.4651 3.5954 0.5495 1.2218 0.9226 0.1235 4.6647 1.7608 7.0185 0.5148 0.7108 0.1390 0.5877 0.0828 2.6199 1.7490 2.1588 1.0025 2.1704 0.8770 3.0255 1.4241 5.4440 6.3507 4.9017 4.4270 7.3616 24.1516 1.8943 1.4759 3.3866 22.3631 79.6046 2.8313 3.3769 1.3095 13.5244 4.1709 5.5315 8.1552 8.0102 10.0581 55.9919 11.7468 28.1797 6.0994 3.7496 7.6212 54.8009 126.9923 2.5779 43.5107 29.9662 9.9596 22.3215 9.0715 28.5175 33.4047 7.9156 4.4499 35.1174 26.9855 9.8793 174.3564 387.9725 6.7530 177.8051 9.7367 27.0159 26.0160 1.2784 56.7545 3.8432 32.4598 7.0091 2.5939 26.4212 22.0021 1.2563 1.6393 12.0273 10.5362 103.8015 5.1322 1.2874 23.4960 3.2852 22.0309 23.8198 7.0186 28.6172 19.5297 3.4270 15.9828 20.8015 3.5155 19.6879 15.1982 18.7494 16.5509 36.9226 7.3378 6.7532 8.5998 98.2156 5.9247 19.2850 154.7097 90.7973 51.3025 58.1888 50.3343 28.4503 43.5932 24.0400 25.4697 6.5264 2.4459 21.0155 13.9321 19.9842 11.2263 8.9611 40.4651 11.9754 73.3357 47.3350 59.7594 19.8287 31.4200 38.6474 6.5791 11.3912 21.9303 15.0709 2.7627
temp: 298.150 k
press: 1.00000 atm
elementType: 17 8 8 8 7 6 6 6 6 6 6 6 6 6 6 6 6 6 6 6 6 6 6 1 1 1 1 1 1 1 1 1 1 1 1 1 1 1 1 1 1 1 1 1 1 1 1 1 1 1 1
symmnumber: 1
zpe: 1120727.4 jmol-1
zpe.correction: 0.426863 hartree
zpe.thermalcorrener: 0.454437 hartree
zpe.thermalcorrenthalpy: 0.455381 hartree
zpe.thermalcorrgfe: 0.363952 hartree
zpe.sumelectzpe: -1441.387142 hartree
zpe.sumelectthermal: -1441.359567 hartree
zpe.sumelectthermalent: -1441.358623 hartree
zpe.sumelectthermalfe: -1441.450053 hartree
dipole: -0.3845 1.4570 0.2203
dipole: 1.5229
quadrupole: -138.4416 -144.2320 -155.7667
quadrupole: -16.8593 -18.7989 -3.6507
quadrupole: 7.7052 1.9148 -9.6200 -16.8593 -18.7989 -3.6507
hfenergy: -1441.8140046 hartree
pointgroup: C01 [X(C18H28Cl1N1O3)]
dipole: 0.1883078 0.5608135 -0.0950598 debye
polarizability: 280.6079871|7.8637068|235.4967984|1.9364703|1.6892645|177.4751337 unknown
InChI: InChI=1S/C18H28ClNO3/c1-6-20(8-7-19)9-10-22-18-11-14(4)17(23-15(5)21)12-16(18)13(2)3/h11-13H,6-10H2,1-5H3
charge 0 multiplicity 1
51 atoms
Cl 5.880824 -3.055051 1.822751
O  0.839985 1.048999 0.189546
O  -4.44511 -0.891573 0.375107
O  -4.745207 -1.16011 -1.938694
N  4.438252 0.201839 -0.307153
C  -1.171301 2.856368 0.921486
C  -1.500248 1.401626 0.57932
C  3.234787 1.021011 -0.047192
C  -0.460247 0.503412 0.191421
C  1.963971 0.165194 -0.151731
C  4.918819 -0.589776 0.84726
C  5.509736 0.876823 -1.084407
C  -2.813026 0.887405 0.595066
C  -0.934229 3.673029 -0.381874
C  -2.236788 3.54267 1.805362
C  -0.736651 -0.839241 -0.153765
C  -2.059853 -1.34751 -0.140498
C  -3.080122 -0.447975 0.236671
C  5.184719 -2.029086 0.383609
C  5.166039 1.03076 -2.578025
C  -2.350337 -2.787365 -0.510983
C  -5.196925 -1.21799 -0.779056
C  -6.591858 -1.632443 -0.364942
H  -0.21267 2.849343 1.476629
H  3.173501 1.826834 -0.799257
H  3.259844 1.512412 0.95224
H  2.000647 -0.689336 0.556046
H  1.853613 -0.22935 -1.181095
H  4.151341 -0.602154 1.642411
H  5.841841 -0.164747 1.299237
H  6.425075 0.26272 -0.991981
H  5.755195 1.876176 -0.6489
H  -3.651479 1.521274 0.896613
H  -0.638841 4.711059 -0.138991
H  -0.133624 3.2174 -0.989259
H  -1.85642 3.710026 -0.991397
H  -2.438155 2.966034 2.726728
H  -1.888382 4.54957 2.099748
H  -3.193264 3.67416 1.264717
H  0.072746 -1.517276 -0.440883
H  4.262043 -2.535647 0.066371
H  5.94578 -2.082393 -0.409198
H  4.993487 0.041565 -3.036697
H  4.255572 1.638875 -2.727944
H  5.993365 1.531659 -3.11425
H  -2.82105 -2.84423 -1.50989
H  -1.424446 -3.386417 -0.530619
H  -3.047974 -3.254411 0.208227
H  -7.08474 -0.808404 0.179426
H  -7.180953 -1.896412 -1.254656
H  -6.543284 -2.494047 0.323145
