program: Gaussian 09
title: 000291093
version: EM64L-G09RevD.01
frameworkgroup: C1[X(C14H13N3S)]
method: RPBEPBE
basis: SDD
operation: Freq
keyword: #p
keyword: freq=noraman
keyword: PBEPBE/SDD
title: #p freq=noraman PBEPBE/SDD
converged: YES YES NO NO
title: Mulliken charges:
elementType: S N N N C C C C C C C C C C C C C C H H H H H H H H H H H H H
charge: 0.246355 -0.472980 -0.485284 0.000741 -0.052330 -0.431540 -0.053648 0.302031 -0.180427 0.305448 -0.406370 -0.285010 -0.407308 -0.234426 -0.238898 -0.239520 -0.138227 -0.510764 0.273822 0.241049 0.219836 0.294289 0.299840 0.303467 0.216197 0.253140 0.216957 0.224766 0.225383 0.246861 0.266551
chargesum: 0.00000
title: Mulliken charges with hydrogens summed into heavy atoms:
elementType: S N N N C C C C C C C C C C C C C C
charge: 0.246355 -0.173140 -0.181817 0.000741 0.221492 0.029345 0.240640 0.302031 -0.180427 0.305448 -0.190173 -0.031870 -0.190351 -0.234426 -0.014132 -0.014137 0.108634 -0.244214
polarizability: 2.34617751e+02 1.08334630e+01 2.06309980e+02 2.10618368e+01 1.91458821e+00 1.16246740e+02
1716.lowfreq: -10.3296 -3.1108 0.0015 0.0021 0.0022 0.5152 13.8298 56.8509 61.4334
frequency: 13.2744 56.8425 61.4264 75.3917 90.6200 126.2993 171.2500 222.9988 235.5167 264.4679 276.2426 299.1285 332.1839 340.9062 399.8276 424.7013 459.1011 473.4510 490.3215 524.1458 534.7897 548.8170 557.7916 582.3306 586.0271 613.2676 621.1795 687.3345 703.2832 720.4263 740.0595 744.0077 781.0482 821.7471 835.8458 837.9406 866.9955 905.5338 910.4484 911.6075 923.4627 954.4257 993.6744 1027.3753 1038.4477 1060.4238 1079.4302 1095.1105 1101.5878 1125.9071 1129.3402 1170.0154 1199.4728 1231.6810 1243.2127 1251.2006 1266.3567 1273.6003 1301.7501 1325.8461 1329.6966 1342.1433 1348.4229 1375.6411 1407.9931 1445.1981 1459.6934 1475.3604 1481.8266 1499.4551 1554.0917 1598.9138 1609.2310 2191.5474 2972.8955 2981.4706 3012.6995 3083.1440 3113.5324 3116.8329 3142.6438 3166.1266 3171.6060 3188.9485 3238.5462 3532.1259 3553.6727
redmass: 6.7545 6.0773 4.7278 5.9889 4.3002 5.5903 5.1771 5.1181 4.7762 5.0945 5.9110 3.6700 3.1209 4.1533 1.9945 2.6371 2.6762 2.1474 3.7285 3.9299 3.0431 4.1254 4.0966 4.0187 4.9175 6.8549 5.5245 6.7288 1.1741 4.1697 2.4348 1.7284 3.9306 4.2910 1.4175 1.4508 2.9051 3.0371 1.3824 1.5044 4.1701 1.2977 3.0894 2.1822 2.3858 2.2198 1.3607 3.0199 3.4157 1.9597 1.8547 1.0529 1.3158 1.5035 1.9020 1.7204 1.4934 1.5815 1.7091 1.2829 1.4802 1.3921 1.4332 4.2961 1.5246 1.4640 1.2917 6.5525 1.8651 2.9080 5.7445 5.5224 6.2968 12.5849 1.0824 1.0839 1.0589 1.1044 1.0872 1.0894 1.0914 1.1003 1.0896 1.0972 1.1004 1.0767 1.0772
irintensity: 0.3574 0.2266 0.7517 0.8977 3.3813 3.4392 2.1696 1.8232 0.5969 3.7277 2.2212 15.9479 11.6525 0.6830 42.0838 71.3553 8.3827 13.1810 5.8183 5.2436 14.1976 2.9930 8.5511 13.3953 1.0969 1.5975 3.6705 0.7841 104.7389 3.1624 78.0984 45.5140 5.4983 6.3958 3.9704 11.0495 13.5296 3.7705 4.0476 0.7861 0.4197 0.0353 3.4808 12.8406 0.0966 27.8794 3.9536 17.0454 48.2513 31.4557 2.4503 0.0541 1.5676 12.5771 39.3741 7.1329 6.5776 30.3614 72.4833 1.3542 5.7101 0.4515 38.0218 136.6659 7.1309 85.5249 27.5528 9.7378 37.5930 154.3129 2.8829 20.3596 31.4786 18.5092 17.7452 12.8908 23.7030 17.0871 21.2765 4.5544 19.1398 27.2159 8.9551 2.9569 0.6868 18.7689 22.6588
temp: 298.150 k
press: 1.00000 atm
elementType: 16 7 7 7 6 6 6 6 6 6 6 6 6 6 6 6 6 6 1 1 1 1 1 1 1 1 1 1 1 1 1
symmnumber: 1
zpe: 628245.0 jmol-1
zpe.correction: 0.239286 hartree
zpe.thermalcorrener: 0.254958 hartree
zpe.thermalcorrenthalpy: 0.255902 hartree
zpe.thermalcorrgfe: 0.194685 hartree
zpe.sumelectzpe: -1102.290740 hartree
zpe.sumelectthermal: -1102.275069 hartree
zpe.sumelectthermalent: -1102.274124 hartree
zpe.sumelectthermalfe: -1102.335341 hartree
dipole: 2.6498 -2.4326 0.7303
dipole: 3.6705
quadrupole: -102.1159 -129.7233 -111.5690
quadrupole: 6.8062 7.1713 -0.7233
quadrupole: 12.3535 -15.2539 2.9004 6.8062 7.1713 -0.7233
hfenergy: -1102.5300261 hartree
pointgroup: C01 [X(C14H13N3S1)]
dipole: 0.9302046 1.0909645 -0.1729233 debye
polarizability: 237.0299575|-5.3581942|203.4881153|-20.7689233|8.1368488|116.6563983 unknown
InChI: InChI=1S/C14H13N3S/c15-9-10-8-13(14-6-3-7-18-14)17-12-5-2-1-4-11(12)16-10/h1-7,10,13,16-17H,8H2
charge 0 multiplicity 1
31 atoms
S  3.018249 1.522497 1.25137
N  0.10421 0.705843 -0.705356
N  -1.661826 -1.179736 0.589188
N  -1.370775 -4.498046 -0.404371
C  0.928337 -0.15346 0.202289
C  0.711909 -1.655406 -0.126397
C  -0.806957 -1.888352 -0.394718
C  -1.214374 1.083298 -0.333469
C  2.380504 0.251413 0.123419
C  -2.086896 0.151612 0.326061
C  -1.69841 2.384823 -0.621598
C  3.372317 -0.144253 -0.765129
C  -3.378384 0.578686 0.723517
C  -1.126084 -3.330129 -0.40479
C  -2.99762 2.787956 -0.243782
C  -3.833678 1.888042 0.45482
C  4.635916 0.528686 -0.579371
C  4.62138 1.451379 0.453352
H  0.568017 0.00339 1.238896
H  1.060486 -2.27051 0.722013
H  1.275024 -1.95625 -1.028092
H  -1.02481 -1.494247 -1.409213
H  0.637478 1.412074 -1.21739
H  -2.304272 -1.758628 1.131615
H  -1.030814 3.094895 -1.126333
H  3.210719 -0.901243 -1.536295
H  -4.04046 -0.137428 1.227138
H  -3.343148 3.800574 -0.476655
H  -4.836978 2.191588 0.771111
H  5.521088 0.330902 -1.188405
H  5.424453 2.089433 0.817676
