program: Gaussian 09
title: 000291082
version: EM64L-G09RevD.01
frameworkgroup: C1[X(C15H13ClN2)]
method: RPBEPBE
basis: SDD
operation: Freq
keyword: #p
keyword: freq=noraman
keyword: PBEPBE/SDD
title: #p freq=noraman PBEPBE/SDD
converged: YES YES NO NO
title: Mulliken charges:
elementType: Cl N N C C C C C C C C C C C C C C C H H H H H H H H H H H H H
charge: -0.047049 -0.509080 0.014981 0.172400 0.415845 -0.726390 0.466749 -0.336060 -0.368133 -0.241434 -0.215164 -0.214890 -0.454954 -0.334888 -0.117261 -0.195397 -0.247383 -0.269861 0.307168 0.256805 0.242503 0.225556 0.276845 0.236631 0.259068 0.256543 0.218197 0.251152 0.224716 0.223647 0.229137
chargesum: 0.00000
title: Mulliken charges with hydrogens summed into heavy atoms:
elementType: Cl N N C C C C C C C C C C C C C C C
charge: -0.047049 -0.201911 0.014981 0.172400 0.415845 -0.001525 0.466749 -0.059215 -0.131503 -0.241434 0.043903 0.041653 -0.236758 -0.083736 -0.117261 0.029320 -0.023736 -0.040724
polarizability: 2.16616930e+02 -2.25013879e+00 1.83821509e+02 1.62264038e+01 -5.62293605e+00 1.35584918e+02
1716.lowfreq: -8.7519 -0.0021 -0.0004 0.0009 5.3937 10.5582 27.1670 37.5705 54.2958
frequency: 27.1004 37.4333 54.2710 76.5096 97.9173 132.6550 148.9255 188.7892 200.6399 227.2770 245.4921 276.8288 297.9947 331.2722 378.7047 400.3373 408.3960 410.6780 423.1526 435.8842 479.1755 513.5675 529.5359 578.0261 606.6274 610.7899 624.8157 633.6965 695.5227 719.6540 730.4755 755.2655 813.5674 826.3576 829.9711 840.2520 879.6521 887.0540 941.9030 957.2247 961.1352 979.0570 979.2949 981.9960 998.0898 1027.6801 1054.4271 1076.3598 1083.1567 1102.0332 1131.6402 1153.6904 1171.5908 1183.6627 1193.5713 1201.1133 1281.4936 1294.6285 1325.9207 1367.2912 1379.4774 1385.5452 1393.2465 1431.8976 1466.0389 1470.5365 1479.3638 1488.3243 1502.6718 1586.3613 1593.8269 1596.6227 1619.7958 2186.9438 3008.0929 3107.9892 3109.6289 3119.2194 3129.2856 3140.6046 3153.2572 3156.4075 3161.0872 3172.2057 3173.5443 3177.5782 3546.9759
redmass: 5.7061 4.2653 5.3162 5.2680 6.9179 8.3592 5.6852 4.5157 2.7855 1.5188 4.4464 4.0733 4.0590 3.9175 5.2604 2.4241 2.9871 3.0405 1.6651 5.5256 4.3323 3.1197 3.5196 5.5306 6.5957 6.0551 6.9842 5.0652 1.9528 3.9871 5.6349 1.7387 2.4655 1.2614 1.6347 1.5586 2.0989 1.5444 2.1874 1.4007 1.3719 1.3625 2.1883 2.0438 4.2873 2.1825 2.9950 2.7563 1.7700 1.6731 1.8802 2.5682 1.0534 1.2486 1.1365 2.4391 2.4001 1.2726 1.4844 5.9306 4.3225 1.4884 2.2425 2.2525 1.0853 1.6768 1.2771 2.1908 1.7324 7.6428 5.1553 5.7501 6.2424 12.6629 1.0346 1.1007 1.0880 1.1012 1.0862 1.0929 1.0886 1.0879 1.0947 1.0991 1.0961 1.0972 1.0771
irintensity: 0.2121 0.0666 0.1939 1.7464 4.3277 0.6793 2.7253 0.5474 0.7547 0.0416 2.1741 0.4584 3.0885 2.1638 3.3078 7.6185 2.5763 1.0009 84.6638 6.0264 15.7891 5.9086 22.3951 4.3090 0.5982 2.2499 0.6127 11.0975 36.0486 3.7199 24.5473 92.6027 9.7034 0.8971 13.2810 35.6086 3.3487 13.9905 3.1006 0.4091 0.1711 1.1009 1.9221 0.6101 51.4955 5.6951 4.6660 45.0346 7.9445 22.4240 5.2997 47.3185 1.2853 35.7798 9.9996 42.4385 83.8580 1.5116 28.2314 0.8468 42.8981 5.6109 28.4426 13.2951 1.4302 70.6246 24.3820 63.7008 127.1737 4.1800 13.6238 10.6912 149.9389 4.9601 9.9738 22.8075 12.3738 13.7877 1.1074 25.5005 0.6324 3.8850 38.1906 6.5523 5.8920 1.7192 25.0663
temp: 298.150 k
press: 1.00000 atm
elementType: 17 7 7 6 6 6 6 6 6 6 6 6 6 6 6 6 6 6 1 1 1 1 1 1 1 1 1 1 1 1 1
symmnumber: 1
zpe: 625274.6 jmol-1
zpe.correction: 0.238155 hartree
zpe.thermalcorrener: 0.254502 hartree
zpe.thermalcorrenthalpy: 0.255446 hartree
zpe.thermalcorrgfe: 0.193048 hartree
zpe.sumelectzpe: -1147.671548 hartree
zpe.sumelectthermal: -1147.655201 hartree
zpe.sumelectthermalent: -1147.654257 hartree
zpe.sumelectthermalfe: -1147.716655 hartree
dipole: -2.0217 -1.0368 1.7217
dipole: 2.8507
quadrupole: -113.7969 -126.3140 -105.7705
quadrupole: -0.8268 6.9609 6.1508
quadrupole: 1.4969 -11.0202 9.5233 -0.8268 6.9609 6.1508
hfenergy: -1147.9097024 hartree
pointgroup: C01 [X(C15H13Cl1N2)]
dipole: -0.8761332 -0.4317005 0.5512883 debye
polarizability: 213.7580319|-11.1739035|186.3103716|16.1379465|4.363829|135.9549544 unknown
InChI: InChI=1S/C15H13ClN2/c1-15(11-17,12-7-9-13(16)10-8-12)18-14-5-3-2-4-6-14/h2-10,18H,1H3
charge 0 multiplicity 1
31 atoms
Cl 4.604073 -2.445963 -0.714383
N  -1.193018 1.238919 -0.309429
N  0.930861 3.887245 0.060789
C  -0.039414 1.441125 0.602446
C  1.112086 0.431752 0.307827
C  -0.483376 1.454937 2.101301
C  -2.05833 0.123304 -0.302962
C  1.294259 -0.037406 -1.016216
C  2.017014 0.015623 1.313687
C  0.495031 2.800415 0.287397
C  2.351975 -0.912929 -1.336755
C  3.082008 -0.86265 1.010409
C  -3.305206 0.240294 -0.985201
C  -1.737069 -1.116621 0.320037
C  3.233767 -1.312979 -0.313786
C  -4.19926 -0.845963 -1.041662
C  -2.646172 -2.194939 0.259398
C  -3.881195 -2.075448 -0.416348
H  -1.566196 2.088948 -0.734646
H  -0.844286 0.457945 2.4005
H  -1.306784 2.177539 2.225048
H  0.340037 1.757431 2.768683
H  0.58835 0.273695 -1.792447
H  1.910708 0.364413 2.344891
H  2.485256 -1.278394 -2.358769
H  3.779023 -1.184756 1.78917
H  -3.567849 1.189428 -1.470659
H  -0.778335 -1.254789 0.826859
H  -5.150732 -0.729384 -1.572984
H  -2.377679 -3.141164 0.743169
H  -4.578246 -2.918429 -0.458366
