program: Gaussian 09
title: 000028012
version: EM64L-G09RevD.01
frameworkgroup: C1[X(C21H30O2)]
method: RPBEPBE
basis: SDD
operation: Freq
keyword: #pfreq=noraman
keyword: PBEPBE/SDD
title: #p freq=noraman PBEPBE/SDD
converged: NO NO NO NO
title: Mulliken charges:
elementType: O O C C C C C C C C C C C C C C C C C C C C C H H H H H H H H H H H H H H H H H H H H H H H H H H H H H H
charge: -0.289290 -0.436080 0.215713 0.139668 0.145232 -0.520437 -0.508822 -0.426172 -0.424134 0.226144 0.175998 -0.714929 -0.729929 -0.618648 0.415723 -0.598898 -0.562965 0.133688 -0.389947 -0.357786 -0.358044 -0.355924 -0.697403 0.220341 0.215691 0.211641 0.229427 0.208336 0.203079 0.207336 0.204640 0.229911 0.242921 0.212640 0.235451 0.235459 0.208630 0.250044 0.239503 0.219467 0.202267 0.229530 0.200594 0.185871 0.189433 0.187899 0.190053 0.193957 0.194962 0.354796 0.213972 0.209905 0.209483
chargesum: 0.00000
title: Mulliken charges with hydrogens summed into heavy atoms:
elementType: O O C C C C C C C C C C C C C C C C C C C C C
charge: -0.289290 -0.081284 0.215713 0.139668 0.145232 -0.084405 -0.067754 -0.014757 -0.012158 0.226144 0.175998 -0.029457 -0.050388 -0.368603 0.415723 -0.359395 -0.141231 0.133688 0.040177 0.017517 0.019908 0.032996 -0.064043
polarizability: 3.41683935e+02 1.45675048e+01 2.30736683e+02 1.67938911e+01 -7.82658013e+00 1.63280308e+02
1716.lowfreq: -9.3555 -5.6684 0.0006 0.0008 0.0010 6.0705 18.9447 27.2163 41.2889
frequency: 17.9519 26.5847 40.6974 57.9569 66.2197 74.9405 95.4304 103.8618 117.9429 131.1336 145.2678 169.7700 184.2022 206.1024 213.0992 220.5142 232.5028 244.3296 250.9940 264.0963 277.2277 295.5362 305.8700 331.0407 340.1438 357.1968 368.6795 386.0630 416.0917 430.0720 444.8631 462.0305 465.6771 481.9421 501.7356 533.6224 581.6653 593.8154 621.2969 645.1577 682.9345 722.6599 728.4368 735.6815 737.8894 756.3091 786.5395 811.5020 825.2814 830.2836 834.8163 868.9580 875.6639 887.9219 892.3800 911.0378 914.1251 923.1442 962.6260 972.0407 979.2717 993.3897 1011.0228 1015.2599 1036.8546 1064.9359 1081.3002 1081.7569 1088.3514 1092.4437 1106.9699 1114.9632 1117.2463 1128.6724 1149.5404 1154.4027 1172.0628 1191.7277 1192.6635 1209.9583 1228.9150 1234.2084 1241.8200 1245.2404 1258.5920 1269.8687 1274.2599 1282.2675 1283.1100 1289.6560 1298.9506 1309.7932 1325.8268 1331.3505 1340.8846 1347.8832 1351.3964 1354.8584 1363.3516 1368.2352 1390.4458 1391.0202 1396.4673 1414.5039 1446.9422 1457.3935 1459.4987 1460.3717 1463.1787 1463.5933 1465.7108 1469.8246 1471.9095 1473.6856 1475.2737 1477.7894 1480.1068 1481.9553 1487.9427 1499.6264 1593.9680 1621.5685 1653.1955 2943.4145 2947.8334 2951.3377 2953.8974 2966.4272 2971.3175 2973.6151 2975.4111 2979.2219 2981.1689 2981.8998 2986.3776 2994.5972 2998.6404 3002.0990 3012.2815 3023.3165 3031.1979 3040.5943 3048.2841 3055.7653 3067.2310 3070.5261 3079.5119 3091.8644 3100.8243 3104.5107 3131.8144 3137.7934 3581.6728
redmass: 3.9189 3.9612 1.6478 3.1775 3.9893 3.3983 2.7094 3.4636 1.6637 2.8722 2.6273 3.3895 3.3952 1.1742 2.0910 3.7767 1.1189 2.4057 1.2653 2.6702 2.9512 2.3511 2.7467 3.7378 2.2396 1.3405 3.6465 3.6832 3.1337 4.0276 3.4748 3.4548 2.5665 3.6089 4.0395 3.9934 2.8207 3.8895 4.3775 4.9590 6.1085 1.0705 3.5660 4.0584 1.1517 3.7037 1.2645 2.5170 2.0395 1.6031 2.2750 2.5024 1.2929 1.8064 1.5886 1.7285 1.6841 1.8059 2.6281 2.2083 1.3187 1.3015 4.0606 3.4118 2.4713 2.8054 2.1960 1.8812 1.7155 2.4764 1.6632 2.0034 2.2548 1.1860 2.3207 1.5540 1.5277 1.7719 2.8266 1.9445 1.2858 1.9976 1.3676 1.3537 2.6903 1.4186 1.2267 1.3188 1.0756 1.1585 1.5069 2.0348 1.4643 1.4510 1.4924 1.5029 1.6212 1.6834 2.3787 1.2437 1.2399 1.2200 6.6962 5.2322 1.0803 1.0536 1.1014 1.1020 1.0724 1.0700 1.0861 1.0874 1.0610 1.0792 1.0957 1.0421 1.0631 1.0824 1.0884 3.3592 7.1920 7.2743 8.0895 1.0619 1.0592 1.0645 1.0591 1.0590 1.0370 1.0606 1.0712 1.0636 1.0668 1.0351 1.0904 1.0866 1.0353 1.0999 1.0928 1.1004 1.1034 1.0984 1.1042 1.1044 1.1005 1.0994 1.0992 1.1012 1.0995 1.1007 1.0902 1.0917 1.0659
irintensity: 0.0820 0.2052 0.0816 0.1138 0.9687 0.3167 0.1947 0.1831 0.0489 0.3795 0.3307 0.5199 1.0295 0.0891 0.3021 0.2891 0.0128 1.0779 0.4006 0.5776 3.8217 2.3921 1.9158 6.5502 13.9465 85.1365 14.6353 0.6895 10.4528 0.3178 4.9128 9.6981 0.5613 1.9562 1.7274 5.1458 1.0701 15.1028 14.9147 2.3534 0.0400 10.5624 4.0357 3.2939 0.4361 0.4687 5.2180 3.6689 10.5860 22.2548 9.0791 5.4461 2.7756 8.3411 13.3793 8.7666 6.7413 7.8924 19.6772 1.7665 13.0493 0.3092 2.2735 1.0374 13.7053 4.0285 0.3631 2.5865 14.3272 213.3608 66.3691 30.8268 22.2313 1.2071 65.1386 11.8603 3.2312 20.9128 22.7829 13.2635 9.6378 3.2955 5.9587 6.9473 48.3545 19.3093 3.8757 1.3796 4.3728 3.6480 22.1499 13.9841 3.1119 2.3332 3.3556 1.9772 7.0251 1.6050 33.8947 29.7056 33.3219 11.0105 14.3076 8.4561 3.0107 0.2561 6.4027 3.2810 10.8405 0.5008 1.5464 10.1106 5.0381 1.3619 8.1022 12.0992 7.3126 3.6755 22.8494 108.0582 26.1921 77.1779 7.8482 51.7660 7.4552 28.2066 13.0851 74.2945 37.2550 7.2910 23.6471 30.5464 67.1955 15.0126 19.9221 62.7411 27.3172 3.9511 29.3852 17.2397 23.9819 75.3037 60.1248 57.1321 98.0059 61.7051 15.9193 22.4771 26.5329 29.7882 15.8850 4.2715 40.2503
temp: 298.150 k
press: 1.00000 atm
elementType: 8 8 6 6 6 6 6 6 6 6 6 6 6 6 6 6 6 6 6 6 6 6 6 1 1 1 1 1 1 1 1 1 1 1 1 1 1 1 1 1 1 1 1 1 1 1 1 1 1 1 1 1 1
symmnumber: 1
zpe: 1205400.6 jmol-1
zpe.correction: 0.459113 hartree
zpe.thermalcorrener: 0.483278 hartree
zpe.thermalcorrenthalpy: 0.484223 hartree
zpe.thermalcorrgfe: 0.404855 hartree
zpe.sumelectzpe: -966.928998 hartree
zpe.sumelectthermal: -966.904832 hartree
zpe.sumelectthermalent: -966.903888 hartree
zpe.sumelectthermalfe: -966.983255 hartree
dipole: 2.0443 0.4531 -0.2443
dipole: 2.1082
quadrupole: -131.8118 -128.2362 -143.7338
quadrupole: 3.5602 -0.5830 -1.8399
quadrupole: 2.7821 6.3577 -9.1398 3.5602 -0.5830 -1.8399
hfenergy: -967.3881106 hartree
pointgroup: C01 [X(C21H30O2)]
dipole: -0.8024218 -0.1777341 -0.1116276 debye
polarizability: 341.542912|16.5834946|229.5778827|-15.1147391|12.4030625|164.5801301 unknown
InChI: InChI=1S/C21H30O2/c1-4-5-6-7-10-15-13-17-16-11-8-9-12-18(16)21(2,3)23-20(17)14-19(15)22/h13-14,22H,4-12H2,1-3H3
charge 0 multiplicity 1
53 atoms
O  -2.593291 1.625213 0.92195
O  2.011161 2.82542 -0.066128
C  -3.512519 -0.599254 0.182305
C  -3.813298 0.888152 0.408531
C  -2.240004 -1.01479 -0.123374
C  -4.705527 -1.544017 0.216793
C  -1.914806 -2.479715 -0.401928
C  -4.413597 -2.895804 -0.469958
C  -3.050892 -3.442675 0.002782
C  -1.139519 -0.031519 -0.172983
C  -1.360533 1.269182 0.360515
C  -4.226442 1.562678 -0.924275
C  -4.847369 1.143697 1.519757
C  0.161913 -0.316579 -0.666293
C  1.222863 0.614953 -0.641114
C  -0.329709 2.226507 0.417421
C  2.609088 0.269066 -1.15459
C  0.947059 1.893481 -0.082997
C  3.632651 -0.003595 -0.016681
C  5.040064 -0.341503 -0.554453
C  6.080671 -0.572049 0.563354
C  7.492653 -0.900162 0.026911
C  8.526848 -1.1310 1.149064
H  -5.012641 -1.722445 1.269761
H  -5.579124 -1.06081 -0.266591
H  -1.691294 -2.599668 -1.483693
H  -0.983818 -2.755569 0.131052
H  -5.225214 -3.615147 -0.251896
H  -4.387568 -2.7540 -1.5691
H  -2.861718 -4.448078 -0.418284
H  -3.069665 -3.550372 1.105791
H  -4.465833 2.627371 -0.755245
H  -3.40325 1.492892 -1.656466
H  -5.114736 1.065196 -1.354977
H  -4.534853 0.658336 2.459692
H  -4.924286 2.229551 1.69737
H  -5.844484 0.766724 1.234273
H  0.364933 -1.305778 -1.092513
H  -0.547483 3.212189 0.844573
H  2.997469 1.103468 -1.769677
H  2.547849 -0.6230 -1.808525
H  3.687216 0.893846 0.628728
H  3.263666 -0.83416 0.618473
H  4.985166 -1.244107 -1.199476
H  5.386518 0.485611 -1.209685
H  5.73964 -1.396915 1.224114
H  6.133797 0.333182 1.203459
H  7.436956 -1.799792 -0.619621
H  7.833867 -0.07119 -0.626585
H  1.70579 3.684363 0.317822
H  9.528897 -1.354273 0.738818
H  8.616308 -0.235767 1.792856
H  8.229628 -1.978241 1.796143
