program: Gaussian 09
title: 000291058
version: EM64L-G09RevD.01
frameworkgroup: C1[X(C13H14N2O)]
method: RPBEPBE
basis: SDD
operation: Freq
keyword: #p
keyword: freq=noraman
keyword: PBEPBE/SDD
title: #p freq=noraman PBEPBE/SDD
converged: YES YES NO NO
title: Mulliken charges:
elementType: O N N C C C C C C C C C C C C C H H H H H H H H H H H H H H
charge: -0.243115 -0.413003 0.017026 -0.499208 0.070218 -0.480139 0.372787 0.033704 0.038200 -0.381223 -0.337603 -0.141282 -0.206579 -0.234424 -0.178544 -0.732118 0.226248 0.226925 0.252035 0.211955 0.330750 0.233762 0.219665 0.263130 0.233411 0.236367 0.217800 0.222762 0.220007 0.220486
chargesum: 0.00000
title: Mulliken charges with hydrogens summed into heavy atoms:
elementType: O N N C C C C C C C C C C C C C
charge: -0.243115 -0.082253 0.017026 -0.046036 0.070218 -0.016149 0.372787 0.033704 0.038200 -0.147461 -0.074473 0.078383 0.026831 0.001943 0.039256 -0.068863
polarizability: 2.05301213e+02 4.42136032e+01 1.46697587e+02 -1.05750520e+01 1.16686957e+01 1.32756970e+02
1716.lowfreq: -7.0613 -0.0008 -0.0004 -0.0002 4.5450 7.9836 24.8160 29.2616 71.7233
frequency: 24.5756 29.1973 71.6998 84.2956 118.0251 148.9433 173.6031 196.8362 250.4298 262.2410 296.0815 309.5793 334.7188 400.2021 421.7695 448.3265 466.8213 474.4304 499.6617 556.6950 571.6714 593.0087 667.0486 696.4097 717.1127 746.2872 755.1409 774.8607 788.4614 811.8423 857.5482 867.0698 895.8486 927.9341 942.3064 952.5578 976.9564 986.3825 1000.4067 1023.6395 1044.7041 1061.0031 1099.3019 1113.0509 1155.6624 1170.3764 1189.7878 1197.1933 1227.1688 1259.3104 1272.3247 1275.4075 1291.8086 1306.8911 1322.8431 1345.7796 1375.6172 1392.8452 1407.2466 1440.1209 1461.8853 1464.8694 1470.3121 1472.9451 1474.2165 1535.1398 1579.8321 1615.1525 1620.0100 1690.0482 2963.3547 2970.5923 3003.1568 3036.9986 3051.9134 3066.7133 3073.3043 3081.3221 3090.2282 3126.8101 3145.4773 3160.0020 3176.6636 3502.1992
redmass: 4.5550 4.2713 2.7066 2.4724 5.3191 2.5378 3.6555 1.3156 4.8229 2.5534 2.6508 5.2332 3.4630 3.9072 4.5578 7.8498 3.1867 2.7003 3.2299 4.3153 4.5087 8.1083 4.2090 6.1414 1.6585 2.2148 1.6333 1.3352 3.7687 3.5673 2.0015 1.5363 5.2013 2.1953 1.7468 1.3784 1.0941 1.3228 2.4251 2.0835 1.5332 2.0882 2.7926 1.6986 2.5577 1.1929 1.3303 1.4517 2.2701 1.7034 2.1185 1.5135 1.2825 2.1324 1.3224 1.6074 2.5581 1.2396 3.9793 1.1488 1.0491 1.5329 1.6982 1.1860 2.0739 9.5942 6.8839 5.0133 7.1304 6.1704 1.0364 1.0647 1.0599 1.0971 1.0953 1.0934 1.0959 1.0996 1.0926 1.0879 1.0894 1.0940 1.0999 1.0768
irintensity: 0.3559 0.1007 2.3980 1.6456 0.1018 1.3483 1.5244 1.1030 5.3628 1.6964 3.5500 4.1369 0.9774 2.2249 9.2169 7.7674 6.8014 1.8376 2.5708 1.8874 2.0950 12.4950 2.5681 0.3743 7.3358 0.8356 0.5528 178.5746 17.4817 1.5037 3.1801 1.0359 2.0807 10.1047 19.8459 4.7790 57.9576 0.0109 6.4191 5.8990 0.1188 28.3546 12.2033 10.2737 9.3159 11.3041 3.5068 17.3411 2.0184 7.6076 3.7251 5.5438 0.6236 2.9781 1.8653 4.8774 2.8823 11.3302 8.3546 14.5041 15.0518 1.1475 26.2196 22.2435 6.0302 40.0930 7.9531 415.6079 3.4551 0.8682 38.8507 45.1810 30.5570 30.3455 4.4051 4.3438 1.0824 11.4530 70.7609 4.9949 8.0815 15.4804 17.9096 28.7706
temp: 298.150 k
press: 1.00000 atm
elementType: 8 7 7 6 6 6 6 6 6 6 6 6 6 6 6 6 1 1 1 1 1 1 1 1 1 1 1 1 1 1
symmnumber: 1
zpe: 633435.9 jmol-1
zpe.correction: 0.241263 hartree
zpe.thermalcorrener: 0.255804 hartree
zpe.thermalcorrenthalpy: 0.256748 hartree
zpe.thermalcorrgfe: 0.198342 hartree
zpe.sumelectzpe: -687.364119 hartree
zpe.sumelectthermal: -687.349578 hartree
zpe.sumelectthermalent: -687.348634 hartree
zpe.sumelectthermalfe: -687.407040 hartree
dipole: 3.1074 1.6008 -0.9465
dipole: 3.6214
quadrupole: -84.5436 -98.1464 -90.0849
quadrupole: -1.9451 -7.1352 0.1669
quadrupole: 6.3814 -7.2214 0.8400 -1.9451 -7.1352 0.1669
hfenergy: -687.6053818 hartree
pointgroup: C01 [X(C13H14N2O1)]
dipole: 1.2470516 -0.6195977 0.3014617 debye
polarizability: 207.0070119|-42.9727743|145.9124447|6.2087672|14.2350742|131.836313 unknown
InChI: InChI=1S/C13H14N2O/c1-2-3-4-9-12-13(16)15-11-8-6-5-7-10(11)14-12/h2-3,5-8,15H,4,9H2,1H3
charge 0 multiplicity 1
30 atoms
O  -1.007669 2.573635 1.007113
N  0.993648 1.373752 0.960834
N  0.101254 -0.03744 -1.296942
C  -2.058278 1.130186 -1.304719
C  -0.685201 0.876372 -0.73715
C  -3.207018 0.614336 -0.374309
C  1.848644 0.414198 0.407507
C  1.372006 -0.28997 -0.747456
C  -0.287432 1.681196 0.462558
C  3.131719 0.137465 0.943113
C  2.206536 -1.268513 -1.348934
C  -3.160032 -0.880605 -0.138411
C  3.937799 -0.837541 0.32752
C  3.47896 -1.542789 -0.819424
C  -3.150083 -1.4729 1.08468
C  -3.117162 -2.965404 1.329795
H  -2.116477 0.632133 -2.288204
H  -2.201128 2.218827 -1.442616
H  -3.170207 1.162183 0.584091
H  -4.162156 0.886837 -0.868824
H  1.290967 1.910182 1.782923
H  3.489478 0.679528 1.826683
H  -3.129646 -1.515412 -1.038864
H  1.820201 -1.792264 -2.228462
H  4.929891 -1.053849 0.738178
H  4.118361 -2.298201 -1.286705
H  -3.170283 -0.830225 1.979507
H  -3.089311 -3.528303 0.379947
H  -2.22938 -3.254151 1.926204
H  -4.0064 -3.298265 1.900565
