program: Gaussian 09
title: 000291061
version: EM64L-G09RevD.01
frameworkgroup: C1[X(C16H15N3)]
method: RPBEPBE
basis: SDD
operation: Freq
keyword: #pfreq=noraman
keyword: PBEPBE/SDD
title: #p freq=noraman PBEPBE/SDD
converged: YES YES NO NO
title: Mulliken charges:
elementType: N N N C C C C C C C C C C C C C C C C H H H H H H H H H H H H H H H
charge: -0.488330 -0.477537 0.000318 -0.212582 -0.435997 -0.053704 0.456316 0.294636 0.307235 -0.452912 -0.401720 -0.405110 -0.406598 -0.235535 -0.240726 -0.241057 -0.220950 -0.235690 -0.239499 0.264436 0.237111 0.235758 0.291903 0.296740 0.301638 0.239115 0.252964 0.213490 0.215781 0.224239 0.224993 0.229855 0.228727 0.232692
chargesum: 0.00000
title: Mulliken charges with hydrogens summed into heavy atoms:
elementType: N N N C C C C C C C C C C C C C C C C
charge: -0.191590 -0.175899 0.000318 0.051854 0.036872 0.238199 0.456316 0.294636 0.307235 -0.213796 -0.148756 -0.191621 -0.190817 -0.235535 -0.016487 -0.016064 0.008905 -0.006963 -0.006808
polarizability: 2.46878675e+02 -6.42590284e+00 1.91894164e+02 1.31398510e+01 5.03439363e+00 1.34601160e+02
1716.lowfreq: -0.0003 0.0005 0.0007 5.5668 7.5456 10.4356 27.3210 55.6210 66.9025
frequency: 27.2800 55.5970 66.8983 75.4041 89.1591 126.8855 173.9811 206.5445 240.8103 263.6002 280.1038 313.7525 331.4477 338.9630 401.9495 405.5558 427.5558 461.8485 486.3734 518.0043 532.8294 555.4154 566.9461 573.5628 581.8190 615.6363 623.5880 647.2596 707.0742 720.5856 741.8113 756.1625 779.2837 822.1933 834.5065 855.6709 868.9835 908.8863 912.2756 919.6694 934.8305 953.1993 978.4383 990.1975 996.1755 998.9141 1026.7930 1040.5148 1050.0760 1087.9034 1094.7290 1106.2646 1128.6850 1169.8446 1173.8738 1187.2354 1191.6931 1216.0565 1239.7308 1253.2376 1267.7330 1271.1680 1296.2553 1321.7152 1328.1255 1341.5735 1349.5451 1376.8761 1386.4517 1409.5736 1442.1327 1450.8713 1464.5665 1482.9451 1484.8070 1501.9889 1593.2108 1601.0680 1609.9067 1613.6876 2190.4345 2968.5109 2980.4239 3007.8778 3076.5446 3110.5995 3114.3613 3120.2417 3121.7881 3136.0304 3142.0196 3147.8124 3165.2749 3165.6958 3515.2371 3551.4764
redmass: 4.0754 4.7639 5.4265 5.1247 4.1469 5.2394 4.8088 4.9784 4.0074 4.8665 4.4110 3.4435 3.1439 4.2267 2.5107 2.4455 2.7558 2.9529 3.0824 3.0234 2.7914 3.7000 3.6905 2.3287 5.6736 6.1606 5.7521 4.9570 1.7339 4.1648 1.2634 2.7106 2.5136 4.1200 1.4985 1.2470 3.1922 1.3851 2.9926 1.9062 2.4827 1.2957 1.3896 6.1703 2.4796 1.4964 2.1863 2.3818 2.4117 1.7790 3.4828 3.3401 2.0678 1.0537 1.0568 1.1164 1.3208 2.0589 1.5985 2.1580 1.6460 1.4508 1.8096 1.3980 1.1630 1.3972 1.1641 5.4947 5.1125 1.5669 2.1168 1.3641 1.3610 1.9139 2.1353 2.8603 6.0041 5.3994 6.2470 6.1787 12.5864 1.0822 1.0851 1.0592 1.1040 1.0875 1.0893 1.0862 1.0881 1.0911 1.0911 1.0959 1.1014 1.1004 1.0760 1.0772
irintensity: 0.1126 0.3690 0.6481 0.6212 3.3395 2.7915 1.9230 0.5391 0.7980 5.6576 3.7140 11.8217 14.9279 2.7342 11.4722 15.7219 61.9174 6.7294 20.1457 4.8174 9.7810 5.4088 11.2215 34.3313 5.3851 1.7230 1.5681 7.9334 48.1555 1.7273 111.4400 21.7482 31.3446 1.7697 0.0663 0.1708 11.6152 3.5768 3.2518 2.7503 0.6056 0.0196 0.0716 0.5916 0.8621 0.0917 9.7657 1.5746 11.8518 5.9039 41.2239 40.6925 27.6776 0.0007 0.0441 1.1786 1.3109 0.6134 13.1066 12.9919 18.2788 10.7933 63.7806 15.6055 4.1518 19.2014 13.1230 150.7558 11.8067 5.3319 14.8269 83.2120 57.3576 54.5785 1.8849 147.1855 2.7797 23.5192 32.3724 5.7005 18.9049 17.8883 19.6691 26.0329 16.1814 22.1386 5.7402 9.4840 2.5306 10.6483 18.6716 33.5382 29.8043 22.3254 16.5122 21.7356
temp: 298.150 k
press: 1.00000 atm
elementType: 7 7 7 6 6 6 6 6 6 6 6 6 6 6 6 6 6 6 6 1 1 1 1 1 1 1 1 1 1 1 1 1 1 1
symmnumber: 1
zpe: 716221.0 jmol-1
zpe.correction: 0.272794 hartree
zpe.thermalcorrener: 0.288628 hartree
zpe.thermalcorrenthalpy: 0.289572 hartree
zpe.thermalcorrgfe: 0.228823 hartree
zpe.sumelectzpe: -781.600857 hartree
zpe.sumelectthermal: -781.585023 hartree
zpe.sumelectthermalent: -781.584079 hartree
zpe.sumelectthermalfe: -781.644828 hartree
dipole: -2.5937 -3.0612 0.2259
dipole: 4.0186
quadrupole: -100.8305 -131.5573 -106.3535
quadrupole: -3.0171 4.4022 2.8432
quadrupole: 12.0833 -18.6436 6.5603 -3.0171 4.4022 2.8432
hfenergy: -781.8736511 hartree
pointgroup: C01 [X(C16H15N3)]
dipole: 1.0119909 1.1947257 0.2195545 debye
polarizability: 246.6398201|-4.3009168|192.1903778|-15.0817418|1.7633031|134.5438015 unknown
InChI: InChI=1S/C16H15N3/c17-11-13-10-16(12-6-2-1-3-7-12)19-15-9-5-4-8-14(15)18-13/h1-9,13,16,18-19H,10H2
charge 0 multiplicity 1
34 atoms
N  -0.0863 0.760034 -0.573427
N  -1.952571 -1.194288 0.504823
N  -1.714006 -4.424835 -0.755735
C  0.697756 -0.201608 0.258877
C  0.422612 -1.667595 -0.18764
C  -1.090001 -1.83966 -0.513989
C  2.184364 0.134707 0.175893
C  -1.412864 1.123401 -0.209928
C  -2.331881 0.16545 0.338623
C  2.929754 0.405435 1.349238
C  2.844081 0.181472 -1.081321
C  -1.857122 2.457943 -0.399491
C  -3.626791 0.593315 0.725498
C  -1.442339 -3.26727 -0.653968
C  -3.157298 2.865123 -0.030664
C  -4.041129 1.932478 0.557462
C  4.307919 0.711878 1.2738
C  4.21784 0.497916 -1.160145
C  4.955416 0.761257 0.01827
H  0.374331 -0.107626 1.314761
H  1.012489 -1.917863 -1.088419
H  0.72675 -2.356529 0.620795
H  -1.273269 -1.357631 -1.497309
H  0.471079 1.536723 -0.938593
H  -2.631311 -1.796307 0.972965
H  2.428441 0.376949 2.324369
H  2.282436 -0.031611 -1.999294
H  -1.155741 3.190381 -0.82027
H  -4.323114 -0.145719 1.142682
H  -3.467382 3.903814 -0.185852
H  -5.047595 2.234989 0.864552
H  4.872485 0.9152 2.190518
H  4.714894 0.533482 -2.136071
H  6.022666 1.001494 -0.04211
