program: Gaussian 09
title: 000291070
version: EM64L-G09RevD.01
frameworkgroup: C1[X(C17H14ClN3O)]
method: RPBEPBE
basis: SDD
operation: Freq
keyword: #p
keyword: freq=noraman
keyword: PBEPBE/SDD
title: #p freq=noraman PBEPBE/SDD
converged: YES YES NO NO
title: Mulliken charges:
elementType: Cl O N N N C C C C C C C C C C C C C C C C C H H H H H H H H H H H H H H
charge: -0.058745 -0.334347 -0.495858 -0.627896 -0.008854 -0.639617 0.536755 0.295220 -0.268319 0.117275 0.343424 -0.373639 -0.446118 -0.358909 -0.313533 -0.229537 -0.282019 -0.208804 -0.195413 -0.114602 0.199703 -0.286787 0.226028 0.251771 0.280447 0.386814 0.246770 0.238917 0.266376 0.205079 0.234399 0.234635 0.256426 0.255913 0.342751 0.324292
chargesum: 0.00000
title: Mulliken charges with hydrogens summed into heavy atoms:
elementType: Cl O N N N C C C C C C C C C C C C C C C C C
charge: -0.058745 -0.334347 -0.109044 0.039146 -0.008854 -0.161818 0.536755 0.295220 0.012128 0.117275 0.343424 -0.126868 -0.207200 -0.092532 -0.108453 0.004862 -0.047384 0.047622 0.060500 -0.114602 0.199703 -0.286787
polarizability: 3.25259056e+02 1.03353991e+01 2.35369510e+02 -1.09133484e+01 -4.45342226e-01 1.39563005e+02
1716.lowfreq: -0.0013 -0.0010 0.0012 3.2025 4.8196 8.0721 15.0204 16.1952 25.1098
frequency: 14.8946 16.1173 25.0742 37.8600 50.1063 73.7625 86.8534 111.4295 130.1584 155.4890 188.5415 226.8915 248.3834 260.5614 287.1547 291.4243 318.9869 344.8694 356.0139 391.4122 406.9017 409.5762 416.7365 438.8463 484.8975 502.0862 510.2079 525.7731 579.7572 581.7811 615.3202 618.3600 626.2025 634.2722 662.3168 691.9186 713.6711 734.7107 748.1611 774.6235 787.7083 805.7825 826.0931 831.5008 849.9442 862.6198 889.7134 898.3957 928.4968 944.3641 954.9438 967.5197 988.8890 1000.0785 1039.8114 1049.3468 1071.6760 1088.2606 1100.0004 1109.7006 1151.9502 1173.6963 1183.1013 1183.6831 1203.0293 1223.9052 1261.6712 1284.7660 1300.9308 1332.7454 1333.2554 1353.6446 1376.2577 1395.6660 1404.7532 1433.3063 1454.2892 1458.1291 1477.3227 1510.4286 1565.0702 1586.7353 1597.6409 1598.6610 1617.1298 1623.2623 1645.4747 2172.9997 2978.1678 3036.7437 3102.7508 3127.0510 3130.1372 3132.1997 3138.8897 3143.0243 3166.8884 3167.8864 3170.9047 3180.9287 3536.3123 3689.4236
redmass: 5.3269 7.4237 4.7749 6.9346 6.4495 5.8717 5.7878 10.2175 6.0855 5.4333 6.4778 5.1266 5.3851 6.2487 3.9940 4.7698 6.0791 4.5388 4.8928 6.5044 3.5540 3.0160 3.5781 4.0236 1.2922 4.0914 3.1342 3.1932 1.7250 2.2624 6.9206 5.4817 6.8413 6.5858 5.0168 3.7598 3.7079 4.0848 1.8992 2.5107 2.9235 4.5541 1.4415 1.2752 2.4451 2.2562 1.2078 1.4453 1.7375 1.3805 1.4545 1.3719 1.3173 4.2779 2.0416 3.0681 2.7737 2.5535 1.7916 1.8422 1.8199 1.6066 1.0775 1.1186 2.7915 1.9092 1.5963 1.4303 1.3380 2.0714 1.6995 2.9741 6.9928 2.6479 6.7978 2.7141 2.5871 1.1441 2.1954 3.2548 3.2925 7.4177 4.0258 3.5392 2.0375 5.4413 2.1759 12.6392 1.0609 1.0992 1.0834 1.0868 1.0899 1.0898 1.0892 1.0904 1.0958 1.0950 1.0961 1.0961 1.0453 1.1038
irintensity: 0.2826 1.3589 0.1204 3.8477 1.7467 1.6342 4.4607 0.4834 2.8469 2.9990 0.3848 7.3302 7.0543 2.0180 3.7789 5.8909 9.4267 2.0175 3.7435 5.2061 4.3678 0.7958 0.9676 4.4647 120.7261 24.2577 29.3950 14.5341 73.1712 53.9866 10.4726 8.0499 0.9519 13.0875 17.5715 44.0428 7.1045 3.5031 59.0014 17.8719 14.9395 5.0610 41.1488 7.4851 6.3619 13.8816 137.5840 22.2609 14.8178 0.8121 1.3518 1.3108 0.8731 49.6331 4.1472 9.5029 43.7831 2.9343 7.6089 5.0605 1.1054 5.1009 5.0940 4.2963 3.9796 24.6080 1.3408 9.2146 4.8754 141.7271 42.5773 356.5842 1.9705 5.8966 111.1490 14.7882 38.6245 27.7929 76.2149 408.3550 15.4874 17.6644 317.1288 312.1483 102.4491 20.2392 79.1341 18.7296 23.9463 5.7049 454.0894 22.2029 10.1257 7.6984 4.9472 26.8512 19.0030 6.6436 0.8260 5.2343 79.5467 34.4314
temp: 298.150 k
press: 1.00000 atm
elementType: 17 8 7 7 7 6 6 6 6 6 6 6 6 6 6 6 6 6 6 6 6 6 1 1 1 1 1 1 1 1 1 1 1 1 1 1
symmnumber: 1
zpe: 711130.7 jmol-1
zpe.correction: 0.270855 hartree
zpe.thermalcorrener: 0.290841 hartree
zpe.thermalcorrenthalpy: 0.291786 hartree
zpe.thermalcorrgfe: 0.218353 hartree
zpe.sumelectzpe: -1354.211209 hartree
zpe.sumelectthermal: -1354.191223 hartree
zpe.sumelectthermalent: -1354.190279 hartree
zpe.sumelectthermalfe: -1354.263712 hartree
dipole: 3.4269 -4.8722 3.4685
dipole: 6.8929
quadrupole: -116.6680 -146.6666 -134.0243
quadrupole: -22.0682 2.6669 8.7453
quadrupole: 15.7850 -14.2137 -1.5713 -22.0682 2.6669 8.7453
hfenergy: -1354.4820648 hartree
pointgroup: C01 [X(C17H14Cl1N3O1)]
dipole: 1.4698671 1.9500532 -1.1794408 debye
polarizability: 322.9007791|-19.2966335|236.6849059|-0.149226|12.7061913|140.6058869 unknown
InChI: InChI=1S/C17H14ClN3O/c18-13-8-5-12(6-9-13)7-10-14(11-19)21-16-4-2-1-3-15(16)17(20)22/h1-6,8-10,21H,7,20H2
charge 0 multiplicity 1
36 atoms
Cl -6.426164 2.122778 1.103827
O  4.21519 -1.72678 -0.188533
N  1.697836 -1.052006 -0.113691
N  5.787089 -0.134404 -0.717696
N  0.100101 -3.998928 0.732187
C  -2.025469 -1.592999 -1.138895
C  -3.117666 -0.669526 -0.59013
C  2.09207 0.288664 -0.051017
C  -0.641004 -1.000428 -0.990146
C  3.501738 0.605901 -0.133284
C  0.402051 -1.583121 -0.305979
C  -3.099645 -0.26492 0.770169
C  -4.167123 -0.204387 -1.420102
C  1.165403 1.357026 0.148415
C  3.909775 1.960276 0.012105
C  1.605672 2.68344 0.275067
C  2.9855 3.000447 0.205393
C  -4.101808 0.579577 1.295192
C  -5.179119 0.645454 -0.915457
C  -5.127907 1.024781 0.438254
C  4.504249 -0.481264 -0.340816
C  0.233096 -2.905133 0.266632
H  -2.223781 -1.779514 -2.213221
H  -2.072744 -2.576211 -0.633619
H  -0.480058 -0.028929 -1.470911
H  2.510704 -1.709658 -0.053514
H  -2.298686 -0.617879 1.430565
H  -4.202067 -0.506492 -2.473521
H  0.100684 1.136237 0.250333
H  4.977654 2.208179 0.01441
H  0.869345 3.476241 0.447455
H  3.32718 4.033475 0.319442
H  -4.087343 0.882229 2.346365
H  -5.986999 1.001292 -1.561393
H  6.459722 -0.89168 -0.83225
H  6.05852 0.812863 -0.966635
