program: Gaussian 09
title: 000291028
version: EM64L-G09RevD.01
frameworkgroup: C1[X(C15H16N2O)]
method: RPBEPBE
basis: SDD
operation: Freq
keyword: #p
keyword: freq=noraman
keyword: PBEPBE/SDD
title: #p freq=noraman PBEPBE/SDD
converged: YES YES NO NO
title: Mulliken charges:
elementType: O N N C C C C C C C C C C C C C C C H H H H H H H H H H H H H H H H
charge: -0.268972 -0.506205 -0.605974 0.073000 0.388021 -0.741386 0.172649 0.450341 -0.363696 -0.436039 -0.232533 -0.241545 -0.458172 -0.339801 -0.240932 -0.196034 -0.246569 -0.278013 0.327470 0.255065 0.209846 0.250146 0.272613 0.251070 0.230316 0.228281 0.221387 0.244955 0.231901 0.355736 0.335236 0.218560 0.216386 0.222891
chargesum: 0.00000
title: Mulliken charges with hydrogens summed into heavy atoms:
elementType: O N N C C C C C C C C C C C C C C C
charge: -0.268972 -0.178735 0.084997 0.073000 0.388021 -0.026329 0.172649 0.450341 -0.091083 -0.184969 -0.002217 -0.013265 -0.236785 -0.094845 -0.009031 0.022527 -0.030183 -0.055122
polarizability: 2.08596262e+02 -8.72370084e+00 1.78768865e+02 1.40815405e+01 -1.03557588e+01 1.33757820e+02
1716.lowfreq: -6.1016 -0.0006 -0.0002 0.0002 3.6192 5.0350 41.7177 46.5761 58.9575
frequency: 41.7009 46.4967 58.9258 72.0713 88.7257 111.4722 182.1011 216.5442 219.3982 230.1658 258.2528 284.1788 307.4620 352.5650 365.6001 404.1572 411.4136 468.2881 491.9586 520.7652 552.2926 583.4950 589.9188 600.9133 615.7513 618.2152 621.4415 637.5639 693.4974 707.3438 712.3138 733.3828 754.4379 762.6420 814.7855 823.4124 861.1553 863.5994 877.5229 931.2742 949.6535 956.9245 973.5465 979.2441 985.4348 989.7721 1003.4295 1021.3525 1026.1093 1055.6770 1066.0850 1073.5807 1088.8150 1111.6446 1142.7029 1168.4020 1173.2871 1188.3361 1190.7432 1226.9632 1293.6432 1314.1338 1328.1344 1335.7486 1376.4673 1381.2365 1386.7824 1431.7447 1435.8879 1467.8689 1472.6852 1482.2426 1483.8484 1503.6169 1577.2111 1586.8335 1590.1996 1608.3840 1622.6040 1647.1902 2996.3578 3093.8636 3105.3727 3109.9724 3121.9532 3125.1658 3133.2278 3135.3382 3145.7406 3152.7642 3155.8095 3166.2386 3167.1058 3444.6246 3506.0036 3658.4910
redmass: 4.8213 3.8933 4.4871 4.8251 5.0105 4.7633 4.1528 2.1117 3.1917 3.1993 1.9161 3.4544 4.2999 3.5051 4.2775 2.8460 2.9441 3.3483 3.4477 2.8439 3.9122 2.1660 1.2131 1.6857 6.0639 4.8553 3.5125 1.4148 1.9074 1.8382 4.5968 3.1811 1.8102 2.2806 2.9097 1.2781 1.2800 2.3848 1.5090 1.5384 2.2210 1.3648 1.3378 4.9744 1.3754 5.7604 1.3347 2.5635 2.1516 2.3998 1.7926 1.8244 1.5713 2.0107 3.1681 1.0500 1.0544 1.1369 1.1101 3.1311 2.2039 1.3802 1.5839 3.0640 7.4559 4.2341 1.2723 2.1838 2.2849 1.0869 1.4284 1.5971 1.6385 2.4367 2.2598 5.0914 2.3217 5.8678 6.2492 3.7023 1.0348 1.0997 1.1006 1.0867 1.0864 1.0847 1.0875 1.0933 1.0917 1.0957 1.0946 1.1013 1.0990 1.0756 1.0451 1.1042
irintensity: 0.5466 0.6060 1.5402 4.5970 0.8634 4.1690 0.8839 2.6341 4.5299 2.5442 1.0654 0.8187 0.4709 0.9872 20.8660 0.4018 0.0405 5.3954 2.3196 15.5129 10.9573 67.8636 9.1412 148.4903 0.4625 17.2309 13.7645 54.4170 36.5882 66.6703 1.3236 42.7406 85.2848 9.4666 22.4650 2.7045 3.2983 6.9693 11.3319 2.9169 15.0148 0.1176 1.0884 2.5547 0.4814 0.2615 1.7094 16.2014 4.0910 4.7957 2.7680 4.6365 12.7219 7.5326 16.9569 1.2096 0.9799 13.5806 7.5840 77.7869 14.1331 1.0867 3.6773 189.9639 1.6161 41.2575 20.3889 11.5998 21.5284 11.7953 15.9677 19.0441 7.9880 268.8514 89.7356 7.1039 74.1711 22.1187 180.8532 218.6462 15.8899 28.9725 12.8330 11.9436 2.1741 1.0499 2.9959 31.6874 14.4657 26.4086 44.4931 21.1583 8.5510 137.8197 33.6653 63.8575
temp: 298.150 k
press: 1.00000 atm
elementType: 8 7 7 6 6 6 6 6 6 6 6 6 6 6 6 6 6 6 1 1 1 1 1 1 1 1 1 1 1 1 1 1 1 1
symmnumber: 1
zpe: 726153.6 jmol-1
zpe.correction: 0.276577 hartree
zpe.thermalcorrener: 0.292655 hartree
zpe.thermalcorrenthalpy: 0.293599 hartree
zpe.thermalcorrgfe: 0.232767 hartree
zpe.sumelectzpe: -764.653844 hartree
zpe.sumelectthermal: -764.637766 hartree
zpe.sumelectthermalent: -764.636822 hartree
zpe.sumelectthermalfe: -764.697654 hartree
dipole: 4.2360 -1.5006 1.1577
dipole: 4.6407
quadrupole: -93.4597 -109.1079 -103.6102
quadrupole: -0.9258 4.0195 1.2894
quadrupole: 8.5996 -7.0486 -1.5509 -0.9258 4.0195 1.2894
hfenergy: -764.9304213 hartree
pointgroup: C01 [X(C15H16N2O1)]
dipole: 1.6524231 0.5035441 -0.591124 debye
polarizability: 205.5999037|7.4510121|179.1034218|-22.5083912|-4.5371375|136.4196216 unknown
InChI: InChI=1S/C15H16N2O/c1-15(14(16)18,12-8-4-2-5-9-12)17-13-10-6-3-7-11-13/h2-11,17H,16H2,1H3
charge 0 multiplicity 1
34 atoms
O  0.715337 -3.402216 0.164654
N  -0.732173 -1.176137 0.222545
N  2.624509 -2.327782 -0.597991
C  0.463094 -1.062044 -0.624299
C  1.309632 0.185254 -0.277279
C  0.094691 -1.166285 -2.141213
C  1.285836 -2.36774 -0.296411
C  -1.829808 -0.304206 0.240332
C  1.409713 0.591508 1.079263
C  2.033788 0.911688 -1.257761
C  2.216083 1.687624 1.447248
C  2.843055 2.013259 -0.889706
C  -3.024827 -0.734397 0.894585
C  -1.809364 1.001816 -0.333921
C  2.941383 2.403087 0.464105
C  -4.150746 0.107141 0.969057
C  -2.947396 1.832906 -0.253403
C  -4.127477 1.401149 0.393458
H  -0.874926 -2.134886 0.565114
H  -0.515194 -0.301519 -2.452122
H  0.987178 -1.227119 -2.787787
H  -0.500603 -2.082092 -2.295305
H  0.828034 0.048622 1.83201
H  1.954769 0.644073 -2.316874
H  2.274571 1.990493 2.498696
H  3.388055 2.567855 -1.662082
H  -3.058447 -1.736032 1.342294
H  -0.905039 1.378965 -0.819648
H  3.564668 3.25777 0.74945
H  3.080777 -1.451379 -0.851464
H  3.183575 -3.16777 -0.451941
H  -5.053923 -0.25133 1.47699
H  -2.904864 2.833544 -0.700115
H  -5.004959 2.053579 0.450723
