program: Gaussian 09
title: 000291027
version: EM64L-G09RevD.01
frameworkgroup: C1[X(C16H15N3)]
method: RPBEPBE
basis: SDD
operation: Freq
keyword: #pfreq=noraman
keyword: PBEPBE/SDD
title: #p freq=noraman PBEPBE/SDD
converged: YES YES NO NO
title: Mulliken charges:
elementType: N N N C C C C C C C C C C C C C C C C H H H H H H H H H H H H H H H
charge: -0.474632 -0.687334 -0.002458 -0.144858 0.312097 0.215360 -0.212738 -0.319834 -0.304419 0.472434 -0.356138 -0.280987 -0.233756 -0.384422 -0.397100 -0.194883 -0.231573 -0.234562 -0.239757 0.256494 0.302660 0.234158 0.240772 0.253116 0.214708 0.223283 0.222578 0.224721 0.234221 0.298947 0.305618 0.227645 0.229139 0.231498
chargesum: 0.00000
title: Mulliken charges with hydrogens summed into heavy atoms:
elementType: N N N C C C C C C C C C C C C C C C C
charge: -0.171972 -0.082769 -0.002458 0.111635 0.312097 0.215360 0.021420 -0.079062 -0.051303 0.472434 -0.141430 -0.057704 -0.011177 -0.159700 -0.162878 -0.194883 -0.003928 -0.005423 -0.008260
polarizability: 2.39967899e+02 2.28486353e+00 2.15868219e+02 1.41235382e+01 -1.75711089e+00 1.37261952e+02
1716.lowfreq: -9.0125 -5.1755 -2.6258 -0.0008 -0.0006 0.0003 21.0574 25.4267 32.3150
frequency: 20.8155 25.3600 32.2833 58.0434 76.5793 95.6848 113.8698 157.1489 169.2481 205.4020 241.3857 282.8052 291.0669 295.4293 305.2441 373.9423 402.9117 434.6188 451.1795 456.6313 489.2252 502.2245 524.0053 553.9782 559.5285 566.6006 602.1929 615.9647 619.5697 672.1324 697.6637 723.2555 740.7769 761.4769 788.7972 829.7179 834.4287 836.0158 849.6348 871.3274 905.1658 923.3925 932.1432 954.0221 976.0749 978.4956 988.1024 990.1971 1000.6639 1020.0068 1028.0758 1051.1573 1082.3698 1120.4083 1147.0421 1171.2689 1173.7290 1192.3748 1216.1237 1233.0190 1241.3445 1260.4143 1297.3780 1300.8006 1309.6707 1313.0166 1338.3154 1385.3926 1400.2475 1440.4507 1448.3086 1459.2136 1486.0769 1512.3394 1585.3656 1599.4524 1609.4966 1612.4912 1637.7791 1665.6047 2187.3993 2955.3610 3095.8888 3112.4496 3117.3011 3120.9885 3126.5070 3130.6056 3139.2350 3144.3433 3149.7780 3165.9623 3166.2861 3501.4267 3503.8097 3646.2717
redmass: 3.8739 5.2563 4.4922 7.3110 4.9361 4.7258 3.8113 5.0972 3.7835 3.0265 2.9882 2.7166 4.0023 2.8615 2.4444 5.7571 2.7694 3.3547 3.9051 3.1479 2.5664 4.6482 1.5294 3.0449 5.7409 5.6696 7.0728 4.5135 1.3709 4.5097 1.7504 3.8400 1.2544 1.7554 5.1230 2.5305 1.5274 2.8894 1.3027 3.5612 1.4296 1.4597 3.5122 1.2996 1.8261 1.9938 1.3132 5.6281 1.2962 1.8868 2.1554 1.8410 1.6596 2.0949 1.9121 1.0619 1.0634 1.1208 1.5400 2.3161 1.3655 1.5573 1.4888 1.4236 1.4326 2.6610 1.2571 6.8279 4.9916 2.2709 2.2404 1.7039 2.3020 3.4627 5.8137 6.3371 3.0660 5.8898 1.4227 6.0031 12.5864 1.0807 1.0904 1.0894 1.0875 1.0868 1.0862 1.0871 1.0913 1.0931 1.0962 1.1005 1.1015 1.0619 1.0600 1.0996
irintensity: 0.1935 0.1983 0.5875 2.4077 1.1327 2.7091 0.1724 1.1975 0.5134 0.8399 2.5283 23.0736 8.9076 9.4892 25.1910 4.1252 0.0192 13.2507 5.2344 28.9191 3.7509 21.3974 170.1272 23.4925 17.1214 12.6665 1.8982 15.0875 130.8257 8.4398 47.0995 4.1197 119.2337 74.6661 0.6307 1.1937 1.1501 7.4064 0.2621 3.7947 6.3946 0.2113 12.8809 0.7852 15.2150 6.3051 18.5235 0.8020 9.6708 0.6815 6.1491 16.2005 12.9310 2.5421 64.8793 0.5185 0.2764 2.1818 29.0598 32.0774 13.0732 28.3860 0.9511 5.0953 10.8821 86.4676 5.6062 3.5280 10.3564 15.6349 61.7706 13.6473 13.2530 180.1265 2.0764 24.5555 20.3505 1.8875 149.7993 7.5279 6.9771 7.4451 5.0711 26.1086 16.5219 9.6265 1.0033 6.7770 8.6978 32.6308 40.1047 19.3382 25.4773 3.6551 33.1129 21.6987
temp: 298.150 k
press: 1.00000 atm
elementType: 7 7 7 6 6 6 6 6 6 6 6 6 6 6 6 6 6 6 6 1 1 1 1 1 1 1 1 1 1 1 1 1 1 1
symmnumber: 1
zpe: 708062.3 jmol-1
zpe.correction: 0.269687 hartree
zpe.thermalcorrener: 0.287072 hartree
zpe.thermalcorrenthalpy: 0.288016 hartree
zpe.thermalcorrgfe: 0.222094 hartree
zpe.sumelectzpe: -781.590332 hartree
zpe.sumelectthermal: -781.572947 hartree
zpe.sumelectthermalent: -781.572003 hartree
zpe.sumelectthermalfe: -781.637925 hartree
dipole: -0.2904 -2.7109 0.6390
dipole: 2.8003
quadrupole: -93.5645 -128.4616 -106.4661
quadrupole: -2.0407 10.6279 -4.2367
quadrupole: 15.9329 -18.9642 3.0313 -2.0407 10.6279 -4.2367
hfenergy: -781.860019 hartree
pointgroup: C01 [X(C16H15N3)]
dipole: 0.0768908 -0.3447346 1.0435594 debye
polarizability: 237.2644397|20.6137928|140.4717039|5.4896996|-7.8257567|215.3619272 unknown
InChI: InChI=1S/C16H15N3/c17-12-14(11-10-13-6-2-1-3-7-13)19-16-9-5-4-8-15(16)18/h1-11,14,19H,18H2
charge 0 multiplicity 1
34 atoms
N  -1.509742 -0.491342 -1.348346
N  -3.531205 -2.247542 -0.722871
N  -0.58921 0.134141 -4.617281
C  -0.631678 0.506325 -1.9580
C  -2.248249 -0.2431 -0.16022
C  -3.297945 -1.169397 0.157181
C  0.817225 0.561995 -1.447068
C  -2.011689 0.861702 0.691646
C  1.274688 -0.178411 -0.401886
C  2.641683 -0.178138 0.157681
C  -4.036112 -0.991632 1.352137
C  -2.781797 1.046245 1.864217
C  -3.780571 0.107792 2.203873
C  3.730591 0.521134 -0.438064
C  2.88778 -0.915335 1.350313
C  -0.616109 0.307199 -3.437131
C  5.012739 0.488039 0.144791
C  4.171389 -0.948085 1.935552
C  5.240758 -0.245045 1.335333
H  -1.102105 1.498735 -1.785396
H  -1.305949 -1.471491 -1.564033
H  1.465611 1.266486 -1.985471
H  -1.195822 1.5581 0.468218
H  0.558323 -0.843315 0.102268
H  -4.83496 -1.702747 1.597803
H  -2.583956 1.90554 2.513247
H  -4.36944 0.232955 3.118838
H  3.57906 1.084019 -1.365992
H  2.060047 -1.460415 1.820972
H  -4.264932 -2.911033 -0.479916
H  -3.394512 -2.080016 -1.721366
H  5.83956 1.029212 -0.328868
H  4.337398 -1.520292 2.854948
H  6.23963 -0.269483 1.784592
