program: Gaussian 09
title: 000291013
version: EM64L-G09RevD.01
frameworkgroup: C1[X(C18H15N3O)]
method: RPBEPBE
basis: SDD
operation: Freq
keyword: #p
keyword: freq=noraman
keyword: PBEPBE/SDD
title: #p freq=noraman PBEPBE/SDD
converged: NO YES NO NO
title: Mulliken charges:
elementType: O N N N C C C C C C C C C C C C C C C C C C H H H H H H H H H H H H H H H
charge: -0.218222 -0.327768 -0.026646 -0.130648 0.278666 0.411651 0.399477 -0.358053 -0.361836 -0.460461 -0.428342 -0.238904 -0.257516 -0.240533 0.216048 -0.755935 0.181525 -0.300663 -0.340451 -0.201571 -0.202986 -0.240168 0.243155 0.239432 0.240565 0.238420 0.230645 0.228333 0.229400 0.245735 0.246549 0.249303 0.262007 0.257347 0.228447 0.232091 0.231906
chargesum: 0.00000
title: Mulliken charges with hydrogens summed into heavy atoms:
elementType: O N N N C C C C C C C C C C C C C C C C C C
charge: -0.218222 -0.327768 -0.026646 -0.130648 0.278666 0.411651 0.399477 -0.114897 -0.122403 -0.219896 -0.189922 -0.008259 -0.029182 -0.011133 0.216048 -0.014348 0.181525 -0.038656 -0.083104 0.026876 0.029106 -0.008263
polarizability: 2.96751505e+02 -1.05841911e+01 2.28130697e+02 -1.01644854e+01 2.57750681e+00 1.91927614e+02
1716.lowfreq: -10.1473 -6.7649 -0.0009 -0.0008 -0.0007 3.6683 16.0700 24.0002 40.1778
frequency: 15.8024 23.9462 40.1684 57.3033 74.8419 86.8405 117.4600 140.7941 152.5015 177.0360 183.3346 226.7475 250.3929 291.0509 302.3943 344.4323 364.1761 407.1859 416.3109 452.8636 465.8514 471.2392 510.0770 520.9212 527.3469 536.8144 572.4307 587.8412 603.9570 612.0859 635.6253 656.7411 694.6450 714.9242 745.9553 781.3590 783.7313 785.9467 799.7979 813.1059 852.6198 861.8894 878.3709 917.0576 938.1475 942.0283 963.2929 984.5931 985.6050 986.5546 986.8062 995.2747 999.0283 1017.0164 1024.1689 1033.8212 1054.8589 1069.1708 1079.3049 1110.9475 1148.8539 1163.0868 1170.9326 1172.2050 1178.0395 1204.5221 1225.3186 1237.8430 1267.0686 1303.0474 1318.9977 1371.7773 1378.5280 1384.0904 1387.8102 1406.8479 1420.5411 1441.3970 1442.9320 1446.5464 1455.4008 1455.8321 1468.4752 1515.5973 1584.6696 1587.0427 1601.3197 1603.4176 1627.7377 1639.1580 3008.6368 3098.0874 3124.1526 3128.5095 3129.6104 3134.6225 3134.6585 3140.8123 3147.6004 3149.5291 3155.4433 3165.1943 3166.0329 3167.0490 3173.6517
redmass: 5.5186 3.7898 5.0991 6.1626 4.0191 4.8291 5.7600 4.3709 1.0291 4.1033 5.7544 7.7421 4.4447 6.1294 4.5234 5.4656 5.0605 2.8971 3.6133 4.7371 5.0234 3.3121 5.7770 4.5040 4.5152 4.1572 4.6141 4.8237 4.2059 6.3698 4.3335 4.6090 1.8456 5.2069 1.3576 1.7548 2.4110 3.8219 3.7224 1.7432 1.2470 5.3720 1.6656 1.4861 1.4557 3.1516 1.3783 1.7000 1.3795 3.7203 2.9140 1.3548 1.3189 2.1573 2.4094 1.6714 2.9515 2.5235 1.5679 3.3535 1.4663 1.3596 1.0583 1.1588 1.2044 2.6376 2.0540 1.9678 1.7093 1.8394 2.5646 2.6710 6.1043 1.2555 7.9184 3.3590 4.4029 2.8059 2.2558 1.1061 1.8752 1.2384 2.2181 3.8929 6.2073 7.5762 5.5621 6.2671 8.8644 7.0335 1.0362 1.0970 1.0860 1.0871 1.0852 1.0950 1.0948 1.0888 1.0923 1.0948 1.0929 1.1005 1.0955 1.0990 1.1007
irintensity: 0.1022 0.0567 0.9403 0.0448 3.6213 0.9933 1.7898 0.8237 0.3323 2.0525 6.6891 1.0250 0.9345 0.5648 0.8774 4.0452 3.4077 0.0039 0.3187 29.8704 0.5329 1.3246 24.5173 20.7831 8.7041 2.9741 12.1554 18.9424 6.0131 2.0230 3.7929 10.6580 46.5793 0.5791 3.6167 55.7762 54.0061 21.5992 16.8691 26.4603 0.0118 1.3598 0.9861 5.5850 6.5873 113.8194 10.5073 5.4253 0.0049 4.1298 14.1583 0.4366 0.3174 11.8355 8.4997 5.0218 23.4553 31.9153 6.7653 155.7249 19.4632 10.1763 0.2328 19.6697 24.0229 10.7023 81.1264 13.8866 20.4015 123.7416 174.3011 40.7178 47.3972 43.7315 4.2738 3.5001 0.1796 4.1477 9.6683 29.1536 6.0836 13.5193 20.7391 9.3775 2.2865 0.1193 5.8198 1.1523 246.6160 17.4081 2.7822 7.7099 1.4352 2.4007 2.1991 8.7613 13.7278 10.0213 9.5869 43.9795 21.1712 39.0356 16.9534 8.0103 21.3536
temp: 298.150 k
press: 1.00000 atm
elementType: 8 7 7 7 6 6 6 6 6 6 6 6 6 6 6 6 6 6 6 6 6 6 1 1 1 1 1 1 1 1 1 1 1 1 1 1 1
symmnumber: 1
zpe: 749216.2 jmol-1
zpe.correction: 0.285361 hartree
zpe.thermalcorrener: 0.303888 hartree
zpe.thermalcorrenthalpy: 0.304832 hartree
zpe.thermalcorrgfe: 0.236314 hartree
zpe.sumelectzpe: -932.840585 hartree
zpe.sumelectthermal: -932.822059 hartree
zpe.sumelectthermalent: -932.821115 hartree
zpe.sumelectthermalfe: -932.889633 hartree
dipole: 2.7897 -1.9658 -0.0118
dipole: 3.4128
quadrupole: -116.5901 -122.4624 -117.8263
quadrupole: 14.3664 -4.8553 -0.9858
quadrupole: 2.3695 -3.5028 1.1333 14.3664 -4.8553 -0.9858
hfenergy: -933.1259467 hartree
pointgroup: C01 [X(C18H15N3O1)]
dipole: 1.0825175 0.7943002 0.0073177 debye
polarizability: 296.049326|12.0031291|228.6324333|11.2762276|2.4094046|192.1280565 unknown
InChI: InChI=1S/C18H15N3O/c1-14(22)21(20-19-16-10-3-2-4-11-16)18-13-7-9-15-8-5-6-12-17(15)18/h2-13H,1H3
charge 0 multiplicity 1
37 atoms
O  -1.819293 -3.287828 0.267064
N  -0.275185 -1.580666 -0.043581
N  1.069927 -1.215398 0.119813
N  1.320378 -0.005927 -0.289839
C  -1.927464 0.2808 0.214721
C  -1.27491 -0.68976 -0.619588
C  -2.911969 1.150888 -0.395734
C  -1.571488 -0.80031 -1.976621
C  -1.650715 0.417806 1.61372
C  -3.199636 1.017511 -1.794191
C  -3.578944 2.12517 0.418943
C  -2.545043 0.05956 -2.569865
C  -2.317867 1.375194 2.379998
C  -3.289684 2.23778 1.779557
C  -0.628933 -2.899158 0.380282
C  0.48846 -3.755782 0.950434
C  2.690806 0.392957 -0.137158
C  3.737011 -0.426006 0.37473
C  2.970249 1.720685 -0.552381
C  5.042929 0.092302 0.464695
C  4.282077 2.231366 -0.457671
C  5.322463 1.419395 0.050616
H  -1.059594 -1.554792 -2.582346
H  -0.90823 -0.239186 2.078796
H  -3.948095 1.679511 -2.245652
H  -4.32457 2.78034 -0.047061
H  -2.773049 -0.041403 -3.635962
H  -2.099707 1.470844 3.449195
H  -3.805069 2.983637 2.394316
H  0.950045 -3.279475 1.831942
H  1.292924 -3.905366 0.210256
H  0.056233 -4.727195 1.233434
H  3.513496 -1.449708 0.690446
H  2.144919 2.325657 -0.941276
H  5.850758 -0.535592 0.857278
H  4.492002 3.257152 -0.779025
H  6.342166 1.812996 0.124215
