program: Gaussian 09
title: 000291010
version: EM64L-G09RevD.01
frameworkgroup: C1[X(C16H2Cl10O4)]
method: RPBEPBE
basis: SDD
operation: Freq
keyword: #p
keyword: freq=noraman
keyword: PBEPBE/SDD
title: #p freq=noraman PBEPBE/SDD
converged: YES YES YES YES
title: Mulliken charges:
elementType: Cl Cl Cl Cl Cl Cl Cl Cl Cl Cl O O O O C C C C C C C C C C C C C C C C H H
charge: 0.063671 0.063671 0.063668 0.063667 0.068530 0.068530 0.068528 0.068529 0.074431 0.074430 -0.289249 -0.289248 -0.172252 -0.172254 0.737790 0.737791 -0.311665 -0.311675 -0.311662 -0.311650 -0.087355 -0.087359 -0.087349 -0.087346 -0.117500 -0.117500 0.232803 0.232804 -0.224936 -0.224937 0.292546 0.292546
chargesum: 0.00000
title: Mulliken charges with hydrogens summed into heavy atoms:
elementType: Cl Cl Cl Cl Cl Cl Cl Cl Cl Cl O O O O C C C C C C C C C C C C C C C C
charge: 0.063671 0.063671 0.063668 0.063667 0.068530 0.068530 0.068528 0.068529 0.074431 0.074430 -0.289249 -0.289248 -0.172252 -0.172254 0.737790 0.737791 -0.311665 -0.311675 -0.311662 -0.311650 -0.087355 -0.087359 -0.087349 -0.087346 -0.117500 -0.117500 0.232803 0.232804 0.067610 0.067609
polarizability: 4.66690274e+02 -9.66254205e-04 3.29423086e+02 2.58821151e+01 -2.08760085e-04 1.31264639e+02
1716.lowfreq: -3.6288 -1.7781 -0.7455 -0.0006 0.0015 0.0016 6.6466 9.1680 12.2854
frequency: 6.6466 9.1680 11.3793 16.3380 31.8596 35.0213 38.7862 64.3873 67.0463 67.0598 71.2817 85.4700 85.7476 124.0943 126.2407 157.4407 162.8319 184.4154 186.4648 198.7592 199.0078 201.1893 201.1930 208.3384 212.6838 213.7188 213.7331 264.9994 298.0856 300.5392 311.9638 317.5821 317.6657 322.4431 327.4188 327.8429 341.9782 351.0608 359.4475 359.6818 369.7211 493.2294 542.6761 573.7222 581.3535 586.7360 593.1108 593.1886 612.5561 614.2828 663.8829 666.7798 667.0873 709.2115 709.7850 720.1073 720.5177 783.9124 793.0899 825.2034 825.4849 828.8371 900.5574 923.0188 937.5679 958.3516 1011.4111 1060.4589 1061.0317 1066.8173 1092.8767 1227.9785 1228.1782 1268.5638 1289.3511 1329.8113 1330.1095 1337.6874 1337.7321 1355.1176 1356.3341 1537.6634 1537.8174 1543.6742 1543.9290 1659.5981 1662.4156 1665.2885 3166.9868 3170.7464
redmass: 29.9040 22.3360 18.5025 19.6364 24.8620 14.7703 15.3621 17.3170 33.6322 33.6208 27.6265 23.6917 31.1013 15.9413 16.1935 8.3089 2.5411 17.5494 12.4770 34.1791 28.9193 30.8213 30.0439 19.7220 25.8974 34.4032 34.7405 10.9266 16.6326 23.3603 14.5382 13.0616 12.8525 13.6975 17.5738 28.6816 18.7547 16.0715 16.4641 21.4156 12.1168 16.0818 7.5627 12.2818 4.5704 11.8748 12.0870 11.9785 13.1911 12.4330 14.1591 12.0531 13.8604 11.7017 10.8111 12.6560 11.9062 11.7322 11.2431 12.9634 12.9596 13.0365 10.2559 2.1022 12.3891 5.7481 1.0898 10.2496 5.0348 11.9475 2.9617 10.5667 11.9373 1.7331 1.4681 12.0516 12.0508 12.0060 12.0064 11.8691 11.2075 12.0022 12.0020 11.9493 11.9943 6.2403 12.3795 12.8207 1.1002 1.0870
irintensity: 0.0039 0.0051 0.0000 0.0170 0.0000 0.0000 0.2610 0.3836 0.0013 0.0000 0.0000 0.5535 0.0000 2.5938 0.0000 4.7640 0.0000 0.2085 0.0000 0.0000 0.7496 0.2553 0.0000 1.9550 0.0000 0.0000 0.0011 0.0000 0.0000 0.3994 11.2233 0.0000 0.0791 0.0000 0.9992 0.0000 4.6224 0.0000 3.5808 0.0000 22.6321 0.0000 29.7884 6.4203 0.0000 0.0000 0.0648 0.0000 20.5799 0.0000 117.7859 1.1542 0.0003 0.0014 26.1264 0.0001 47.2481 71.1140 0.0000 0.0000 0.2867 251.7957 0.0000 0.0000 371.6608 0.0000 42.1937 412.4955 0.0001 0.0000 734.8711 19.2194 0.0000 851.2249 0.0000 0.0002 282.2014 0.0034 39.4169 0.0000 395.6996 0.0000 1.2714 0.0000 3.8104 0.0000 255.3315 0.0000 0.0000 2.4985
temp: 298.150 k
press: 1.00000 atm
elementType: 17 17 17 17 17 17 17 17 17 17 8 8 8 8 6 6 6 6 6 6 6 6 6 6 6 6 6 6 6 6 1 1
symmnumber: 1
zpe: 367352.6 jmol-1
zpe.correction: 0.139917 hartree
zpe.thermalcorrener: 0.170633 hartree
zpe.thermalcorrenthalpy: 0.171577 hartree
zpe.thermalcorrgfe: 0.068851 hartree
zpe.sumelectzpe: -5510.205203 hartree
zpe.sumelectthermal: -5510.174487 hartree
zpe.sumelectthermalent: -5510.173543 hartree
zpe.sumelectthermalfe: -5510.276269 hartree
dipole: 0.0000 -0.0002 0.0000
dipole: 0.0002
quadrupole: -239.6243 -236.5590 -243.7594
quadrupole: 0.0000 -6.2200 0.0003
quadrupole: 0.3566 3.4219 -3.7785 0.0000 -6.2200 0.0003
hfenergy: -5510.3451202 hartree
pointgroup: C01[X(C16H2Cl10O4)]
dipole: -0.0000136 -0.0000965 0.0000046 debye
polarizability: 466.3967925|0.0017193|329.4230846|27.7171262|-0.0148911|131.5581216 unknown
InChI: InChI=1S/C16H2Cl10O4/c17-5-7(19)11(23)15(12(24)8(5)20)29-3(27)1-2-4(28)30-16-13(25)9(21)6(18)10(22)14(16)26/h1-2H
charge 0 multiplicity 1
32 atoms
Cl 4.018148 -2.754594 -0.479619
Cl -4.019252 -2.754541 0.479555
Cl 4.017153 2.754733 -0.479211
Cl -4.018387 2.754786 0.478346
Cl 7.195255 2.78572 0.158695
Cl -7.196485 2.785605 -0.15958
Cl 7.196266 -2.784529 0.158258
Cl -7.197372 -2.784643 -0.158308
Cl 8.774398 0.000859 0.473944
Cl -8.775567 0.000663 -0.474414
O  2.884737 -0.000123 -0.806943
O  -2.885907 -0.000006 0.806484
O  2.194613 -0.000015 1.447609
O  -2.195778 -0.000098 -1.448065
C  4.247503 0.000108 -0.438639
C  -4.248673 0.000149 0.438177
C  4.937145 -1.223218 -0.296745
C  -4.938287 -1.223213 0.296464
C  4.936701 1.223661 -0.296558
C  -4.937898 1.223665 0.295912
C  6.321177 1.228159 -0.016883
C  -6.322373 1.228091 0.016234
C  6.321623 -1.227257 -0.017074
C  -6.322765 -1.227325 0.016793
C  7.014112 0.000566 0.121896
C  -7.015281 0.000461 -0.122362
C  1.903061 -0.000251 0.240074
C  -1.90423 -0.000163 -0.240529
C  0.560991 -0.00022 -0.384847
C  -0.562159 -0.000152 0.384393
H  0.506436 -0.000271 -1.478385
H  -0.507604 -0.000106 1.477931
