program: Gaussian 09
title: 000291007
version: EM64L-G09RevD.01
frameworkgroup: C1[X(C20H18Cl2O4)]
method: RPBEPBE
basis: SDD
operation: Freq
keyword: #p
keyword: freq=noraman
keyword: PBEPBE/SDD
title: #p freq=noraman PBEPBE/SDD
converged: NO NO NO NO
title: Mulliken charges:
elementType: Cl Cl O O O O C C C C C C C C C C C C C C C C C C C C H H H H H H H H H H H H H H H H H H
charge: -0.043359 -0.043357 -0.321333 -0.321324 -0.197532 -0.197548 0.592516 0.592514 0.592509 0.592506 -0.520887 -0.520887 0.456233 0.456249 -0.578376 -0.578387 -0.578346 -0.578336 -0.802456 -0.802455 -0.802458 -0.802457 0.194920 0.194920 -0.241553 -0.241564 0.258267 0.258271 0.258265 0.258267 0.247129 0.249255 0.226095 0.226095 0.247130 0.249256 0.226097 0.247128 0.249255 0.226098 0.249256 0.247129 0.288631 0.288626
chargesum: 0.00000
title: Mulliken charges with hydrogens summed into heavy atoms:
elementType: Cl Cl O O O O C C C C C C C C C C C C C C C C C C C C
charge: -0.043359 -0.043357 -0.321333 -0.321324 -0.197532 -0.197548 0.592516 0.592514 0.592509 0.592506 -0.520887 -0.520887 0.456233 0.456249 -0.320110 -0.320116 -0.320080 -0.320069 -0.079977 -0.079975 -0.079978 -0.079975 0.194920 0.194920 0.047078 0.047062
polarizability: 4.30563685e+02 3.67207577e-04 2.33009370e+02 -1.21886376e+01 9.41094561e-04 1.46226753e+02
1716.lowfreq: -31.8189 -15.2913 -3.6539 -0.0027 -0.0026 -0.0023 2.8580 8.6699 12.8288
frequency: -31.8181 -15.2913 8.6699 20.3861 35.7098 38.7035 43.9419 83.0607 102.4689 125.6308 134.1567 138.5401 138.5493 139.6606 140.1764 161.0492 170.6953 198.4462 208.3176 225.5464 225.5523 232.8537 232.9592 267.4783 274.9042 275.0347 315.2628 317.4394 324.2307 334.1421 345.2555 404.0285 455.6461 502.2588 504.1285 518.2730 518.3577 536.3248 539.4932 553.7177 555.5843 571.6507 572.4074 600.0922 610.9362 631.6477 696.9045 710.3952 714.3701 725.1961 731.2334 841.1908 872.2031 872.2566 891.1665 896.0755 919.5093 926.9544 951.5753 951.6085 957.6405 963.9175 1011.7238 1013.4537 1015.9921 1023.6837 1024.6398 1038.9332 1038.9357 1048.2659 1048.2742 1048.3714 1048.4489 1087.5804 1101.5135 1139.0089 1139.5892 1235.7877 1235.8385 1264.4562 1286.0539 1304.3447 1307.2453 1366.3214 1366.3340 1401.5367 1401.5507 1402.7143 1402.7500 1410.5171 1410.6283 1422.3076 1422.4025 1461.6795 1461.7116 1462.1137 1462.1296 1476.7098 1476.7259 1481.6435 1481.7029 1593.1409 1593.3813 1608.2469 1608.3207 1634.7844 1638.1055 1658.5669 2987.3329 2987.3414 2987.6888 2987.7131 3068.0313 3068.0395 3068.0509 3068.0535 3098.0987 3098.1144 3098.5446 3098.5507 3156.4730 3156.4846 3158.4798 3158.4909 3164.0096 3167.7187
redmass: 6.5678 3.9855 7.3587 11.2525 9.0975 8.3042 10.8303 7.8796 5.3382 4.2109 2.9044 1.0359 1.0355 1.0764 1.3181 7.4085 2.5193 4.4539 4.9636 2.8821 2.8852 5.8945 5.9175 9.9559 3.0188 3.0837 7.3572 4.8937 5.8289 6.7962 6.8996 7.4558 5.3148 4.2978 4.5589 3.0862 3.0799 4.0779 4.0489 5.2994 4.8321 4.9904 4.9460 4.4458 6.8381 8.0993 6.4342 5.1733 10.8565 3.0014 3.2474 6.0558 1.3067 1.3066 1.6312 1.8015 2.1225 5.3476 3.0917 3.0898 3.4016 3.3513 1.0867 1.8070 1.7106 5.5933 7.6116 1.7529 1.7529 1.5157 1.5157 1.5612 1.5606 4.7737 2.6724 1.5185 1.5638 1.3383 1.3385 1.8388 1.5092 5.9912 5.8165 7.2397 7.2361 1.3116 1.3109 1.2575 1.2542 2.4263 2.4331 3.0201 3.0224 1.0449 1.0449 1.0444 1.0444 1.1620 1.1622 1.2223 1.2228 5.6066 5.6237 9.1698 9.1729 12.0245 11.3007 6.6717 1.0368 1.0368 1.0368 1.0368 1.0973 1.0973 1.0973 1.0973 1.1000 1.1000 1.0998 1.0998 1.0928 1.0928 1.0931 1.0931 1.0993 1.0868
irintensity: 0.0000 0.1043 0.0310 0.0328 0.0000 1.1417 0.0000 0.7525 0.0000 12.3687 0.0000 0.0002 0.0000 0.8915 0.0000 3.2988 0.0000 0.0000 4.4843 0.0164 0.0000 0.0000 3.4041 0.0000 7.0697 0.0000 5.1484 0.0000 4.9644 0.0000 32.1166 0.0000 5.2844 0.0000 0.1129 0.0000 0.0006 0.0000 3.5776 19.5065 0.0000 18.9675 0.0000 0.0000 2.7621 0.0000 22.2077 0.0000 12.5606 12.1191 0.0000 112.8531 0.1453 0.0002 0.0000 86.2970 0.0000 0.0000 7.3421 0.0011 199.3134 0.0000 51.3865 0.0004 383.4612 0.0001 140.5365 0.0013 0.3486 0.0221 0.0099 0.0005 35.6367 0.0026 934.7263 159.3522 0.0113 0.0000 0.0477 766.8857 0.0000 0.0000 1.4693 0.0104 8.9643 0.0340 40.6420 32.8799 0.0015 52.1626 0.0044 0.0003 0.6772 0.0016 58.2302 0.0363 0.0012 0.0005 33.6390 151.5764 0.0067 0.0044 45.9054 0.0945 44.6136 276.3660 0.0175 0.0000 0.4275 61.4990 11.5296 0.0141 0.1162 39.4827 0.4105 6.9053 0.1892 35.6690 29.3247 1.0620 1.7918 3.8254 3.9334 2.2476 0.0000 1.2188
temp: 298.150 k
press: 1.00000 atm
elementType: 17 17 8 8 8 8 6 6 6 6 6 6 6 6 6 6 6 6 6 6 6 6 6 6 6 6 1 1 1 1 1 1 1 1 1 1 1 1 1 1 1 1 1 1
symmnumber: 1
zpe: 855933.7 jmol-1
zpe.correction: 0.326008 hartree
zpe.thermalcorrener: 0.351231 hartree
zpe.thermalcorrenthalpy: 0.352175 hartree
zpe.thermalcorrgfe: 0.267984 hartree
zpe.sumelectzpe: -1992.080680 hartree
zpe.sumelectthermal: -1992.055457 hartree
zpe.sumelectthermalent: -1992.054513 hartree
zpe.sumelectthermalfe: -1992.138704 hartree
dipole: 0.0005 0.0004 0.0001
dipole: 0.0006
quadrupole: -166.5296 -143.5228 -176.4887
quadrupole: 0.0013 7.8459 -0.0015
quadrupole: -4.3492 18.6576 -14.3084 0.0013 7.8459 -0.0015
hfenergy: -1992.4066878 hartree
pointgroup: C01 [X(C20H18Cl2O4)]
dipole: -0.0001868 -0.000162 0.0000345 debye
polarizability: 430.190497|0.0034555|233.0093693|15.9541415|-0.0090497|146.5999415 unknown
InChI: InChI=1S/C20H18Cl2O4/c1-11-7-15(8-12(2)19(11)21)25-17(23)5-6-18(24)26-16-9-13(3)20(22)14(4)10-16/h5-10H,1-4H3
charge 0 multiplicity 1
44 atoms
Cl 8.781685 -0.001716 0.425437
Cl -8.778227 -0.001856 -0.424436
O  2.87978 0.000884 -0.816807
O  -2.876318 0.000816 0.817803
O  2.196254 0.001149 1.439954
O  -2.192745 0.001173 -1.438925
C  6.330152 -1.251913 -0.056347
C  -6.326713 -1.252024 0.057512
C  6.331158 1.250651 -0.055825
C  -6.327676 1.250543 0.056615
C  6.984726 -0.00092 0.072131
C  -6.981265 -0.001038 -0.071145
C  4.272653 0.00028 -0.461607
C  -4.269203 0.000197 0.462586
C  4.940531 -1.22867 -0.330742
C  -4.93709 -1.228764 0.331904
C  4.941518 1.22864 -0.330234
C  -4.938036 1.228551 0.331027
C  7.0660 -2.568222 0.089753
C  -7.062583 -2.568341 -0.088399
C  7.06806 2.566307 0.090839
C  -7.064555 2.566188 -0.090258
C  1.914873 0.001264 0.22336
C  -1.911408 0.001223 -0.22231
C  0.5610 0.001316 -0.387537
C  -0.557532 0.001298 0.388597
H  4.387697 -2.166625 -0.443181
H  -4.384265 -2.166709 0.444459
H  4.38944 2.167087 -0.442279
H  -4.385936 2.167004 0.442904
H  7.882344 -2.654494 -0.650446
H  7.533325 -2.654695 1.08766
H  6.378612 -3.419035 -0.047823
H  -6.375213 -3.419146 0.049312
H  -7.878936 -2.654486 0.651805
H  -7.5299 -2.654955 -1.086297
H  6.381343 3.41773 -0.046313
H  7.884436 2.652272 -0.649362
H  7.5355 2.651948 1.088763
H  -6.377831 3.417621 0.046797
H  -7.531962 2.651696 -1.088209
H  -7.880954 2.652268 0.649904
H  0.493559 0.001321 -1.480446
H  -0.490098 0.001284 1.481508
