program: Gaussian 09
title: 000291001
version: EM64L-G09RevD.01
frameworkgroup: C1[X(C13H10ClN)]
method: RPBEPBE
basis: SDD
operation: Freq
keyword: #p
keyword: freq=noraman
keyword: PBEPBE/SDD
title: #p freq=noraman PBEPBE/SDD
converged: YES YES NO NO
title: Mulliken charges:
elementType: Cl N C C C C C C C C C C C C C H H H H H H H H H H
charge: -0.022739 -0.261583 0.317413 0.326202 0.007884 -0.365993 -0.359541 -0.359774 -0.369410 -0.226514 -0.227039 -0.222154 -0.223975 -0.234319 -0.232514 0.258872 0.266527 0.271621 0.258049 0.231880 0.233634 0.233174 0.232821 0.233672 0.233807
chargesum: 0.00000
title: Mulliken charges with hydrogens summed into heavy atoms:
elementType: Cl N C C C C C C C C C C C C C
charge: -0.022739 -0.261583 0.317413 0.326202 0.007884 -0.107121 -0.093014 -0.088153 -0.111361 0.005365 0.006594 0.011020 0.008846 -0.000647 0.001293
polarizability: 2.18098234e+02 6.21253432e+00 1.66109130e+02 -1.21893555e+01 1.84293198e+00 9.26363344e+01
1716.lowfreq: -18.0614 -6.8251 -2.2849 -0.0018 -0.0012 0.0012 30.6258 58.5819 71.6754
frequency: 30.1546 58.5736 71.6475 85.5858 128.8659 191.1661 224.2095 255.7420 273.4438 304.0284 399.0866 404.3269 444.7875 456.4881 529.7865 591.3263 611.0018 614.1289 660.4045 677.6324 698.0115 701.2045 722.9023 773.7966 785.1689 853.4899 857.4426 917.7170 935.4812 946.0077 981.0648 984.3337 988.7180 989.2808 1000.7152 1001.9874 1025.0393 1029.8443 1084.0270 1084.2512 1157.3623 1174.6761 1175.1197 1190.7337 1194.5913 1270.5138 1316.4429 1323.7908 1375.6677 1380.4483 1427.1206 1431.6199 1470.0861 1474.7670 1505.9482 1582.4926 1585.7830 1605.8651 1607.0998 3129.5218 3129.7047 3138.6082 3140.1036 3150.2422 3152.6751 3161.0833 3163.5945 3172.2757 3173.6151
redmass: 4.2679 3.8363 5.2458 6.2741 8.3723 6.3913 5.6344 6.0351 7.3928 5.8179 2.8153 2.8369 4.2801 4.2937 6.5654 6.0378 6.3226 6.4040 4.4745 8.2052 1.7583 1.7280 4.9348 1.9451 2.1440 1.2463 1.2436 2.4791 1.4117 2.1769 1.3975 1.3999 6.1988 5.8171 1.3251 1.3269 2.4131 2.0304 1.6221 1.5952 3.3076 1.0546 1.0544 1.1220 1.1199 4.2234 1.3493 1.3574 7.3900 7.9740 2.4064 2.2239 2.5264 2.1967 5.5359 5.8872 6.1791 6.0055 6.0263 1.0851 1.0851 1.0884 1.0887 1.0933 1.0934 1.0967 1.0969 1.1008 1.0997
irintensity: 0.5191 0.1862 0.7088 0.4388 0.7169 3.5856 0.2584 3.7778 5.1375 1.0903 0.6686 0.3826 3.0208 2.2327 18.2159 49.2994 4.6674 0.1699 19.0810 19.9464 57.9817 50.6565 17.0844 22.3358 49.2149 1.1882 0.3621 6.7240 1.0558 6.1835 0.7088 1.0890 1.5780 0.9886 0.0645 0.2317 2.0152 11.1005 9.4077 4.7680 4.6759 0.0078 0.0255 9.4899 0.6675 49.8881 0.9580 3.2244 0.6563 0.6878 5.9818 14.1042 21.8410 4.0089 12.9492 1.2771 0.2739 3.1033 0.6033 0.4665 0.0069 3.4986 6.9488 26.8326 19.0278 20.3008 18.5883 13.3309 12.2669
temp: 298.150 k
press: 1.00000 atm
elementType: 17 7 6 6 6 6 6 6 6 6 6 6 6 6 6 1 1 1 1 1 1 1 1 1 1
symmnumber: 1
zpe: 497254.3 jmol-1
zpe.correction: 0.189394 hartree
zpe.thermalcorrener: 0.201970 hartree
zpe.thermalcorrenthalpy: 0.202914 hartree
zpe.thermalcorrgfe: 0.148713 hartree
zpe.sumelectzpe: -1015.123602 hartree
zpe.sumelectthermal: -1015.111026 hartree
zpe.sumelectthermalent: -1015.110082 hartree
zpe.sumelectthermalfe: -1015.164283 hartree
dipole: -0.7872 -4.1154 0.0414
dipole: 4.1903
quadrupole: -78.4008 -96.0035 -92.5882
quadrupole: -4.1782 -4.1416 0.3131
quadrupole: 10.5967 -7.0060 -3.5907 -4.1782 -4.1416 0.3131
hfenergy: -1015.312996 hartree
pointgroup: C01 [X(C13H10Cl1N1)]
dipole: -0.0738588 -1.5620061 0.5219922 debye
dipolederiv: -0.6988646 -0.6566279 0.1694509 -0.3256274 -0.4569799 0.1276065 0.0347529 0.0446018 -0.0711757 0.2843252 0.773697 -0.2063989 0.3047857 0.1494884 -0.0836301 -0.0058407 0.067686 -0.2560406 -0.1653516 0.0301387 0.0037883 -0.0470741 -0.1362198 0.0516 -0.0820075 -0.0486938 0.0103255 -0.1937229 0.046562 -0.0077277 0.0161524 -0.0826616 0.0188187 -0.0157059 0.0758626 0.0300151 0.7983435 -0.2236841 0.0670782 0.0853924 0.3470268 -0.1093422 -0.0190785 -0.1549501 0.09201 -0.0290285 -0.12473 -0.026728 0.1072043 0.0102065 -0.0142963 -0.012999 0.0597766 -0.1085851 -0.018635 -0.0674287 0.041275 0.0174134 -0.0564536 -0.105748 -0.0574456 -0.0004211 0.0176401 -0.014145 0.110984 -0.0234359 -0.1145266 0.0266523 0.0528155 0.001909 -0.004152 -0.1076472 -0.0211506 0.0425336 -0.1073689 -0.1481272 -0.0327773 -0.0111449 0.0070348 -0.066303 -0.0074136 -0.1861945 0.0210534 0.0006186 0.0494079 0.1337478 0.0280589 0.0185737 0.0250671 -0.1441726 0.0043309 -0.0030484 -0.1629149 -0.0031117 -0.1446559 0.0135421 -0.1369791 0.0106773 0.0003997 0.041678 -0.1295247 -0.0748262 -0.1501235 -0.0760289 0.0514394 -0.0639046 0.0373982 -0.1206241 -0.1482269 -0.026807 0.0444791 -0.0199386 -0.0916194 -0.1137406 0.0587319 -0.1108322 0.071848 0.0698193 0.0549191 -0.0550019 0.0357 0.0059917 0.003929 -0.046504 0.0128949 -0.1300515 0.0620475 -0.1063293 -0.0048605 -0.0993486 -0.0679779 -0.0477078 -0.003628 -0.0518896 -0.0253914 0.0205205 0.0792221 0.0530481 0.1057683 0.0450527 -0.0166936 0.0652697 -0.0141652 0.1082003 0.1032912 0.0258283 -0.0241392 0.0148802 0.0779757 0.0867947 -0.0319396 0.0502325 0.0037189 0.1256443 -0.0280137 0.0050815 -0.0074706 -0.0156123 -0.0328474 -0.0210322 -0.0222925 0.1493782 0.029937 0.0171403 0.1027592 0.0198749 0.1078604 0.0063924 0.1156625 0.0048478 0.0310685 0.0685542 -0.0203633 0.0183059 -0.0466989 -0.1151061 -0.0265822 0.0110143 -0.0324934 0.1480714 -0.0147265 0.0489454 0.1011467 0.0326857 0.1288612 0.0136182 0.1138358 0.0078386 -0.0072474 -0.0655254 0.0672544 0.0651561 0.0882386 0.0335539 -0.0406035 0.0674538 -0.0414601 0.1323619 0.0853262 0.0399877 -0.0116291 0.0582058 0.0814101 0.1006098 -0.0301605 0.1020004 -0.0578481 -0.080815 -0.087648 0.0500974 -0.0939987 0.0485147 0.0100964 0.0530109 0.0129524 0.1457682 -0.0574312 0.1159392 -0.0172537 0.1203364 0.0797504 0.0370149 -0.0200244 0.0358169 0.0953917 unknown
polarizability: 213.0896489|6.4456077|161.5818966|-23.4666562|-22.1607965|102.1721534 unknown
InChI: InChI=1S/C13H10ClN/c14-15-13(11-7-3-1-4-8-11)12-9-5-2-6-10-12/h1-10H
charge 0 multiplicity 1
25 atoms
Cl 1.363552 3.137588 -1.102508
N  -0.232959 2.1308 -0.853337
C  -1.374704 0.207228 -0.132578
C  1.204886 0.130199 -0.202151
C  -0.065188 0.888292 -0.419465
C  -1.493895 -1.202144 -0.275957
C  2.197138 0.054924 -1.214991
C  -2.511787 0.964705 0.263954
C  1.419676 -0.537963 1.032667
C  -2.729228 -1.839066 -0.029315
C  3.383433 -0.675661 -0.992709
C  -3.74224 0.322651 0.508702
C  2.617846 -1.248785 1.259821
C  -3.856509 -1.080758 0.36278
C  3.601559 -1.322346 0.246555
H  -0.626647 -1.793317 -0.587331
H  2.034199 0.558341 -2.172443
H  -2.411832 2.04805 0.378144
H  0.654033 -0.48918 1.814606
H  -2.811879 -2.925252 -0.14524
H  4.138697 -0.736127 -1.783661
H  -4.610937 0.913553 0.81882
H  2.780992 -1.746083 2.222045
H  -4.813136 -1.578251 0.557346
H  4.528431 -1.880399 0.419545
