program: Gaussian 09
title: 000027904
version: EM64L-G09RevD.01
frameworkgroup: C1[X(C10H20O)]
method: RPBEPBE
basis: SDD
operation: Freq
keyword: #pfreq=noraman
keyword: PBEPBE/SDD
title: #p freq=noraman PBEPBE/SDD
converged: YES YES NO NO
title: Mulliken charges:
elementType: O C C C C C C C C C C H H H H H H H H H H H H H H H H H H H H
charge: -0.271217 -0.366252 -0.374322 -0.351895 -0.395232 -0.355468 -0.266091 -0.695931 -0.299670 -0.056378 -0.564112 0.191373 0.191292 0.188703 0.187052 0.187336 0.186963 0.212127 0.209893 0.195521 0.195457 0.184672 0.180584 0.209491 0.215634 0.209611 0.195160 0.187496 0.233365 0.218862 0.215975
chargesum: 0.00000
title: Mulliken charges with hydrogens summed into heavy atoms:
elementType: O C C C C C C C C C C
charge: -0.271217 0.016413 0.001434 0.022404 0.026788 0.035509 0.099166 -0.061195 0.082985 0.176987 -0.129275
polarizability: 1.60169334e+02 3.80732883e+00 9.32008203e+01 -8.56724088e+00 2.58030947e+00 9.13156517e+01
1716.lowfreq: -0.0008 0.0003 0.0007 3.2456 4.6365 22.3736 25.2280 43.7582 49.5160
frequency: 24.7827 41.2559 48.8652 60.2555 83.3023 102.6488 113.9470 129.6457 139.7466 151.9260 209.0908 218.4738 225.3013 326.6584 382.2241 415.1696 477.4606 492.0568 629.8395 723.7477 737.3005 773.7727 835.0885 886.7338 900.1782 917.0620 934.3915 947.2891 972.0612 998.4508 1001.3478 1009.7601 1034.5546 1042.2022 1063.2123 1079.9884 1087.5998 1123.8202 1141.6269 1157.8003 1190.0302 1210.0065 1226.7824 1231.8135 1269.1780 1274.8167 1278.1895 1278.9362 1290.2343 1295.2528 1316.0262 1333.7020 1353.3722 1357.3877 1387.7197 1394.8281 1434.7274 1462.8293 1465.0581 1465.2574 1470.1580 1475.1959 1475.9304 1481.8452 1487.6995 1491.8841 1665.0140 2892.7169 2905.0847 2949.1217 2951.8579 2952.7043 2960.5717 2960.7729 2969.2524 2971.2734 2986.7805 2990.7814 2996.7739 3015.7328 3034.9264 3057.0232 3067.7208 3070.5514 3089.6030 3118.7330 3199.2697
redmass: 3.6174 2.5445 2.1650 3.4267 1.8701 2.4375 2.9451 2.3105 2.2204 2.3358 4.4780 2.8888 1.1301 2.7338 3.4997 2.5669 2.9271 2.6173 1.6202 1.0640 1.0884 1.1257 1.1788 2.0190 2.2463 1.2111 2.2709 1.3440 1.6690 3.4819 1.1285 1.3133 3.4400 4.5719 3.4167 2.1312 2.3125 2.7395 1.4837 1.6581 1.6238 1.2365 1.2932 1.3564 1.1878 1.2871 1.1063 1.2102 1.0870 1.1120 1.2722 1.3360 1.5592 1.6750 1.2180 1.4067 1.2302 1.0749 1.0772 1.0853 1.0735 1.0729 1.0453 1.0798 1.0857 1.0918 4.8266 1.0592 1.0557 1.1052 1.0589 1.0589 1.0735 1.0836 1.0580 1.0373 1.0971 1.0592 1.1003 1.1033 1.1045 1.1043 1.1007 1.0993 1.0603 1.0943 1.1142
irintensity: 0.1284 0.3747 1.2880 0.6746 0.6726 0.1966 2.4859 1.2758 0.3142 2.4073 0.0302 1.3954 0.0043 3.5272 0.2656 0.6334 3.8098 2.9159 7.2314 12.9144 0.2240 3.4970 0.2351 9.6560 7.9041 1.3545 7.3798 88.0647 4.2319 13.6261 0.9568 27.2451 26.5762 93.9465 55.2952 0.6944 16.4196 3.5682 0.3897 3.5031 0.8769 2.0544 6.1865 0.1408 0.1708 0.1480 0.0234 0.1285 0.4801 0.2382 15.3533 24.5753 4.5048 0.0155 11.4932 8.5791 15.1285 0.8628 0.7130 4.5328 0.1089 2.0910 11.3776 2.2503 8.4496 19.4143 4.8614 35.1507 96.8628 59.2824 0.3386 5.0223 23.1346 51.9395 120.1324 32.5979 1.0011 45.9065 0.9679 0.2654 54.9970 91.6257 107.8753 55.4744 12.0206 8.5724 28.9247
temp: 298.150 k
press: 1.00000 atm
elementType: 8 6 6 6 6 6 6 6 6 6 6 1 1 1 1 1 1 1 1 1 1 1 1 1 1 1 1 1 1 1 1
symmnumber: 1
zpe: 728799.5 jmol-1
zpe.correction: 0.277585 hartree
zpe.thermalcorrener: 0.292441 hartree
zpe.thermalcorrenthalpy: 0.293385 hartree
zpe.thermalcorrgfe: 0.233527 hartree
zpe.sumelectzpe: -467.321000 hartree
zpe.sumelectthermal: -467.306144 hartree
zpe.sumelectthermalent: -467.305200 hartree
zpe.sumelectthermalfe: -467.365058 hartree
dipole: 0.3530 1.5272 -0.1146
dipole: 1.5717
quadrupole: -69.3540 -71.0330 -69.4894
quadrupole: -3.9429 -0.3033 1.3223
quadrupole: 0.6049 -1.0742 0.4694 -3.9429 -0.3033 1.3223
hfenergy: -467.5985849 hartree
pointgroup: C01 [X(C10H20O1)]
dipole: -0.1391071 -0.5979243 0.0740115 debye
polarizability: 160.1266464|5.4298726|92.1287763|7.8347332|-2.729131|92.4303837 unknown
InChI: InChI=1S/C10H20O/c1-3-5-6-7-8-10-11-9-4-2/h4H,2-3,5-10H2,1H3
charge 0 multiplicity 1
31 atoms
O  2.553957 0.189523 -0.128614
C  -2.437909 0.427075 -0.094511
C  -1.202895 -0.488225 0.06629
C  -3.779232 -0.31628 0.094146
C  0.131494 0.270002 -0.117138
C  -5.013092 0.601908 -0.0633
C  1.353019 -0.636874 0.056139
C  -6.349878 -0.14529 0.133447
C  3.79428 -0.587737 0.025961
C  4.954337 0.312974 -0.31136
C  6.075568 0.43608 0.440288
H  -2.416593 0.896598 -1.10013
H  -2.373271 1.258819 0.63769
H  -1.265788 -1.317712 -0.669074
H  -1.228271 -0.959597 1.071346
H  -3.846848 -1.147361 -0.639066
H  -3.80098 -0.78697 1.099602
H  0.200986 1.098043 0.614565
H  0.171344 0.72966 -1.123714
H  -4.941767 1.434405 0.666216
H  -4.993016 1.068584 -1.069413
H  1.34177 -1.462927 -0.692662
H  1.358606 -1.096644 1.071414
H  -6.456327 -0.966629 -0.60043
H  -7.215551 0.53149 0.010956
H  -6.409605 -0.590807 1.14455
H  3.883811 -0.983415 1.061673
H  3.76776 -1.45882 -0.671722
H  4.845853 0.87643 -1.248352
H  6.90462 1.081879 0.130983
H  6.197218 -0.104281 1.387522
