program: Gaussian 09
title: 000290995
version: EM64L-G09RevD.01
frameworkgroup: C1[X(C13H9Cl2N)]
method: RPBEPBE
basis: SDD
operation: Freq
keyword: #p
keyword: freq=noraman
keyword: PBEPBE/SDD
title: #p freq=noraman PBEPBE/SDD
converged: YES YES NO NO
title: Mulliken charges:
elementType: Cl Cl N C C C C C C C C C C C C C H H H H H H H H H
charge: -0.042562 -0.012788 -0.266819 0.332759 0.325456 0.012334 -0.357404 -0.348068 -0.370300 -0.359761 -0.208348 -0.203376 -0.223544 -0.226037 -0.114868 -0.231434 0.265548 0.278248 0.258142 0.266927 0.259946 0.260946 0.234616 0.234961 0.235429
chargesum: 0.00000
title: Mulliken charges with hydrogens summed into heavy atoms:
elementType: Cl Cl N C C C C C C C C C C C C C
charge: -0.042562 -0.012788 -0.266819 0.332759 0.325456 0.012334 -0.091855 -0.069820 -0.112158 -0.092834 0.051598 0.057570 0.011072 0.008923 -0.114868 0.003994
polarizability: 2.58409308e+02 -5.46086394e+00 1.69221537e+02 1.29233346e+01 2.78664836e+00 9.47215342e+01
1716.lowfreq: -4.0532 -0.0014 0.0017 0.0021 5.1575 13.7216 38.3407 53.6688 60.4123
frequency: 38.1900 53.5830 60.3988 69.7934 117.2501 153.2927 194.2752 222.5889 229.5755 258.0402 310.1669 337.9836 401.8869 409.3819 415.8171 462.0510 479.5402 544.7392 609.7964 622.3908 628.1648 657.0551 686.3800 702.6667 721.9148 738.9668 778.3805 831.9409 841.9603 856.1402 918.3067 943.5103 962.5779 975.9189 982.7382 989.1660 1000.0180 1001.8946 1028.8231 1073.4130 1086.1104 1112.2463 1156.9542 1176.2033 1187.9506 1194.8692 1272.2441 1295.4963 1322.8927 1359.0002 1378.0470 1393.9808 1433.1671 1469.1226 1472.1980 1505.0607 1575.3274 1585.0807 1593.8107 1607.9870 3130.8929 3139.0185 3150.5223 3155.2914 3162.0469 3162.6551 3172.9125 3175.9037 3181.6377
redmass: 4.2524 9.5690 4.8535 5.6662 10.2719 7.2653 7.1099 9.4608 11.8980 6.3871 6.9137 5.1655 2.8285 2.9176 6.9811 5.7451 3.7369 4.9762 6.3693 6.9983 8.3152 4.7545 7.3749 1.6779 3.8030 5.7486 2.1186 1.2719 1.5503 1.2459 2.6222 1.9867 1.3655 1.3792 1.3980 5.9544 3.2411 1.4404 2.2452 2.7968 1.6121 1.3587 3.3356 1.0542 1.1306 1.1187 4.2994 1.2532 1.3644 4.6984 7.7992 4.3229 2.2521 2.7235 2.3054 5.6535 7.6243 6.0030 6.3230 5.9880 1.0851 1.0885 1.0932 1.0887 1.0967 1.0889 1.1009 1.0966 1.0978
irintensity: 0.3898 0.4023 0.4705 0.1971 0.7877 0.7285 4.1431 1.3745 0.7130 2.4146 4.5303 0.9635 0.4190 0.5181 23.2874 25.3845 17.9775 2.1876 3.7326 0.8434 29.5564 13.5331 19.2514 50.7053 19.6635 40.0823 33.2657 6.8661 52.0621 1.1499 9.4664 4.9113 0.5488 2.9682 0.3604 1.4025 39.7028 5.2168 6.9983 55.9378 7.7915 6.1320 3.1720 0.0116 8.3491 1.6993 61.3233 0.5274 3.6048 1.0886 0.9288 6.4638 15.1573 38.2141 29.0359 14.1641 7.4160 2.8674 57.0850 2.0757 0.5268 3.0512 22.6012 1.4742 19.7571 0.6255 11.8428 3.7885 1.1953
temp: 298.150 k
press: 1.00000 atm
elementType: 17 17 7 6 6 6 6 6 6 6 6 6 6 6 6 6 1 1 1 1 1 1 1 1 1
symmnumber: 1
zpe: 472042.3 jmol-1
zpe.correction: 0.179791 hartree
zpe.thermalcorrener: 0.193621 hartree
zpe.thermalcorrenthalpy: 0.194565 hartree
zpe.thermalcorrgfe: 0.137207 hartree
zpe.sumelectzpe: -1474.513407 hartree
zpe.sumelectthermal: -1474.499578 hartree
zpe.sumelectthermalent: -1474.498633 hartree
zpe.sumelectthermalfe: -1474.555992 hartree
dipole: -0.8613 -3.5263 0.1076
dipole: 3.6315
quadrupole: -107.5889 -105.2832 -103.7965
quadrupole: 11.8755 4.4653 1.2220
quadrupole: -2.0327 0.2730 1.7597 11.8755 4.4653 1.2220
hfenergy: -1474.6931989 hartree
pointgroup: C01 [X(C13H9Cl2N1)]
dipole: -0.5709584 -1.2600613 0.3571912 debye
dipolederiv: -0.9106988 0.2638993 -0.1444849 0.2974951 -0.2147936 0.0399299 -0.1632008 0.0428574 -0.0909333 -0.8416432 0.625389 -0.1792142 0.2983788 -0.3385553 0.1027225 -0.0297248 0.0310909 -0.0605979 0.4196322 -0.7509211 0.2064997 -0.2561134 0.0105741 -0.0483402 -0.0286973 0.0862166 -0.2611031 -0.2558116 -0.0181973 -0.0248612 0.0421686 -0.1763712 0.0437192 0.0915547 -0.0490174 0.002994 -0.2002097 -0.0649372 0.0088552 -0.0343111 -0.1017617 0.0189107 0.0081529 0.0793495 0.0306732 0.8580083 0.2582432 -0.0426674 -0.0582606 0.391344 -0.1208668 0.0462225 -0.1584163 0.094363 0.0552582 0.0789194 0.0364731 -0.2048352 0.0781018 -0.0205463 0.0021988 0.0582739 -0.0992949 0.1270738 -0.1304141 0.0424597 0.1496608 0.0322934 0.0612324 0.0318466 -0.0081221 -0.0906494 -0.0431835 -0.0419762 0.1058107 0.1605129 -0.0162899 0.0024118 -0.0039647 -0.0681702 -0.0093175 -0.0197937 0.0762405 -0.0289057 -0.0201085 -0.0473223 -0.1114032 0.06672 0.0057401 0.0169742 -0.4875378 0.0349538 -0.0714314 -0.0162275 0.016244 0.0196831 -0.0987226 0.025248 -0.116809 -0.3041269 0.2109944 -0.0035967 0.2689507 -0.149459 0.0576329 -0.0143971 0.0385587 -0.0948804 -0.1570699 0.0166242 -0.0291917 0.01029 -0.0844423 -0.1193359 -0.04901 -0.1183622 0.0699992 0.0022017 0.0185893 0.1606169 0.0167731 -0.1416937 0.0333382 0.1383507 0.0276124 -0.0006089 1.2812211 -0.3873168 0.2459275 -0.4084479 0.3020335 -0.0369101 0.2581781 -0.0340237 -0.006703 0.0374695 0.1201166 0.0108225 0.1113748 -0.0361055 -0.0477178 0.0102386 -0.052016 -0.0258102 0.0428949 -0.0660247 -0.0484684 -0.0955371 0.0291484 -0.0185499 -0.0597586 -0.016033 0.1103746 0.1114202 0.0449199 -0.003238 0.0226547 0.0088722 -0.0294011 0.0213822 -0.0165976 0.1495613 0.035837 -0.0266064 -0.1024608 -0.0269548 0.1013102 -0.0053419 -0.1221187 -0.0069431 0.0314024 0.110502 -0.0231171 0.0127639 -0.0093292 0.071841 0.0896891 0.0267004 0.0539527 0.0065617 0.0701719 0.0406649 -0.0125361 0.0419027 -0.0267403 -0.0223018 -0.00799 -0.022364 0.1568777 0.0005418 -0.0543859 -0.0457329 -0.0524802 0.0554899 -0.0307819 -0.0415565 -0.0367515 0.146556 0.0975574 -0.0364965 -0.0029269 -0.0569917 0.0690787 0.1009374 0.0166327 0.1039896 -0.0521914 -0.0042702 -0.0628604 -0.1016796 -0.0477779 0.1173425 0.0027321 -0.1136324 -0.0037848 -0.0041386 -0.0254449 -0.1263007 0.0111663 -0.132787 0.0498612 0.0385575 0.0145953 0.037712 0.0967 unknown
polarizability: 250.6285404|-11.9075765|167.1991257|31.0143997|-21.0911214|104.5247128 unknown
InChI: InChI=1S/C13H9Cl2N/c14-12-8-6-11(7-9-12)13(16-15)10-4-2-1-3-5-10/h1-9H
charge 0 multiplicity 1
25 atoms
Cl 5.271168 -1.129504 0.641571
Cl -2.084582 3.044153 -1.05956
N  -0.383351 2.23233 -0.82786
C  0.985459 0.455955 -0.136413
C  -1.564796 0.062774 -0.19761
C  -0.39862 0.972854 -0.410839
C  1.277824 -0.927687 -0.278589
C  2.02634 1.347324 0.245617
C  -1.687304 -0.639901 1.031009
C  -2.546814 -0.123688 -1.20623
C  2.581376 -1.415448 -0.045931
C  3.330768 0.871222 0.480769
C  -2.786475 -1.495957 1.25667
C  -3.631846 -0.997935 -0.985314
C  3.589567 -0.506691 0.330369
C  -3.760021 -1.679771 0.247641
H  0.490475 -1.625674 -0.578738
H  1.800778 2.41137 0.358235
H  -0.92986 -0.503976 1.810745
H  -2.454753 0.405179 -2.159429
H  2.807613 -2.479493 -0.158311
H  4.129916 1.554611 0.781004
H  -2.880448 -2.019543 2.214068
H  -4.379213 -1.143176 -1.772682
H  -4.6097 -2.349828 0.418909
