program: Gaussian 09
title: 000290972
version: EM64L-G09RevD.01
frameworkgroup: C1[X(C18H13N3)]
method: RPBEPBE
basis: SDD
operation: Freq
keyword: #pfreq=noraman
keyword: PBEPBE/SDD
title: #p freq=noraman PBEPBE/SDD
converged: YES YES NO NO
title: Mulliken charges:
elementType: N N N C C C C C C C C C C C C C C C C C C H H H H H H H H H H H H H
charge: -0.290372 -0.055302 -0.151715 0.190301 0.170282 0.241155 0.204988 -0.387445 -0.396467 -0.344901 -0.292493 -0.245470 -0.240428 -0.217454 -0.227178 0.205087 -0.344871 -0.301343 -0.202008 -0.201146 -0.243701 0.235905 0.236819 0.261954 0.294516 0.226479 0.226972 0.227958 0.227724 0.242721 0.261888 0.229619 0.227267 0.230658
chargesum: 0.00000
title: Mulliken charges with hydrogens summed into heavy atoms:
elementType: N N N C C C C C C C C C C C C C C C C C C
charge: -0.290372 -0.055302 -0.151715 0.190301 0.170282 0.241155 0.204988 -0.151541 -0.159648 -0.082947 0.002023 -0.018991 -0.013456 0.010504 0.000546 0.205087 -0.102151 -0.039455 0.027611 0.026121 -0.013043
polarizability: 4.17012300e+02 2.56810085e+00 2.83642582e+02 -1.23800505e-01 -1.73658478e-01 7.94833729e+01
1716.lowfreq: -4.6486 -0.0006 -0.0006 0.0005 2.2023 4.8748 23.0786 45.6453 57.0974
frequency: 22.9612 45.6418 57.0801 100.9190 125.0529 146.9443 168.5976 196.6051 245.7959 271.7475 282.1265 310.6317 387.2212 407.2754 419.3535 426.2653 446.7793 456.2293 519.3977 525.0350 542.5100 574.5265 583.9333 608.3816 614.0062 626.3183 677.5346 693.8518 731.2044 733.2571 754.1832 767.4531 779.8722 780.2256 783.7205 838.6058 849.1193 871.1603 881.7071 932.9178 947.6952 956.2066 965.8193 982.2819 983.2686 986.1516 990.3325 992.0758 997.2400 1013.9509 1017.2711 1027.8749 1061.4428 1080.9673 1109.6148 1131.6818 1160.3014 1164.7688 1170.2930 1171.2286 1203.0641 1217.4438 1239.8436 1282.4518 1306.2434 1312.5428 1322.1363 1354.3606 1386.9568 1400.9691 1405.6129 1435.1000 1442.1407 1444.2114 1468.1713 1469.6957 1484.8638 1583.4945 1588.7451 1598.9889 1603.5075 1610.7203 1629.6132 3128.4958 3130.9571 3132.4353 3138.5798 3143.3117 3144.8182 3153.0422 3162.4479 3163.3111 3165.2810 3172.9614 3181.1201 3217.6040
redmass: 3.7962 5.1721 5.2715 4.5151 5.3725 3.8321 5.7061 5.0109 7.2262 5.6277 5.0949 5.4596 5.6029 2.8963 6.5105 3.1973 6.9632 3.0946 5.6205 3.2556 8.1951 3.4895 4.3047 6.5753 7.0050 7.1768 6.6366 1.8185 5.6826 3.0033 1.6774 1.4852 1.9470 5.2689 2.1717 6.9747 1.2505 1.4103 1.4166 1.4524 1.3960 1.3867 7.4015 1.3499 1.3366 6.2104 1.3066 6.3746 1.3178 2.1496 2.1160 1.8727 3.5408 1.5697 1.6023 1.7872 1.2468 1.2244 1.0612 1.0950 2.4877 2.3853 2.1402 2.9660 1.7685 1.4652 2.1755 8.9709 8.4189 7.5465 3.7116 3.1537 2.4754 2.4720 2.3557 2.7971 3.5632 6.1844 7.0067 7.3666 6.2465 7.6182 7.8812 1.0850 1.0858 1.0857 1.0887 1.0915 1.0913 1.0930 1.0973 1.0984 1.0961 1.0997 1.0970 1.0946
irintensity: 0.0739 0.6609 0.4818 2.5198 0.1273 0.0001 0.4696 4.0435 0.0104 0.7622 0.0140 0.0303 0.1301 0.0250 1.4969 9.2338 16.3957 0.0030 6.1263 13.7072 37.8201 0.0202 2.8387 0.8112 2.5014 8.9914 1.8308 46.4588 0.1885 33.5321 0.1421 150.7736 47.4743 4.8820 17.1993 2.3265 0.0094 0.5831 0.3066 6.1376 3.4132 5.0126 5.9788 0.0120 0.0174 0.0048 0.5359 6.5819 0.7567 0.3875 11.1990 11.0816 29.9439 8.8612 0.3217 36.4948 18.5584 20.3542 0.2893 0.1188 3.9748 41.5033 19.3589 208.2383 4.2491 21.7061 124.2845 374.4816 6.4441 11.8318 14.7005 124.9613 23.2630 42.4409 36.2967 8.6567 43.8338 2.3179 2.0416 1.9549 1.5677 4.9113 4.8292 3.3233 1.1045 0.0913 8.7562 13.8993 10.6310 25.7484 35.7578 41.4663 21.7365 23.9949 9.5577 4.2672
temp: 298.150 k
press: 1.00000 atm
elementType: 7 7 7 6 6 6 6 6 6 6 6 6 6 6 6 6 6 6 6 6 6 1 1 1 1 1 1 1 1 1 1 1 1 1
symmnumber: 1
zpe: 687385.4 jmol-1
zpe.correction: 0.261811 hartree
zpe.thermalcorrener: 0.277369 hartree
zpe.thermalcorrenthalpy: 0.278313 hartree
zpe.thermalcorrgfe: 0.217724 hartree
zpe.sumelectzpe: -856.529244 hartree
zpe.sumelectthermal: -856.513686 hartree
zpe.sumelectthermalent: -856.512742 hartree
zpe.sumelectthermalfe: -856.573331 hartree
dipole: -0.0032 -0.1681 0.0055
dipole: 0.1683
quadrupole: -96.5687 -103.6722 -130.1851
quadrupole: -0.7068 -0.0216 -0.0564
quadrupole: 13.5733 6.4698 -20.0431 -0.7068 -0.0216 -0.0564
hfenergy: -856.7910552 hartree
pointgroup: C01 [X(C18H13N3)]
dipole: -0.0031878 0.0618642 -0.0233446 debye
polarizability: 416.3378313|6.3773469|262.6742602|14.1332647|-61.810045|101.1261633 unknown
InChI: InChI=1S/C18H13N3/c1-2-8-14(9-3-1)19-20-21-17-12-6-4-10-15(17)16-11-5-7-13-18(16)21/h1-13H
charge 0 multiplicity 1
34 atoms
N  -0.532036 0.126539 -0.070099
N  0.780857 0.53138 -0.144612
N  1.643893 -0.389082 0.209412
C  -2.819066 0.416538 -0.282162
C  -2.5632 -0.946319 0.18978
C  -1.551388 1.05539 -0.433933
C  -1.140751 -1.109894 0.316718
C  -3.995853 1.137243 -0.582963
C  -3.419127 -2.021137 0.508427
C  -1.41532 2.382936 -0.873458
C  -0.56514 -2.320689 0.754157
C  -3.879541 2.473863 -1.026404
C  -2.852868 -3.239398 0.947316
C  -2.604772 3.087289 -1.169079
C  -1.445673 -3.382577 1.067142
C  3.007649 0.046876 0.124481
C  3.972044 -0.921828 0.508125
C  3.435219 1.336323 -0.304024
C  5.347445 -0.611365 0.466697
C  4.809778 1.637031 -0.34223
C  5.772143 0.668977 0.041561
H  -4.98177 0.672239 -0.475659
H  -4.50556 -1.914538 0.417625
H  -0.430063 2.843067 -0.979042
H  0.515896 -2.418558 0.842234
H  -4.781676 3.047723 -1.264203
H  -3.505228 -4.082807 1.198226
H  -2.542258 4.12499 -1.514589
H  -1.028509 -4.33598 1.409692
H  3.620395 -1.90644 0.833795
H  2.687055 2.077905 -0.599112
H  6.085002 -1.364529 0.764469
H  5.139001 2.628946 -0.672167
H  6.839719 0.912586 0.008378
