program: Gaussian 09
title: 000290971
version: EM64L-G09RevD.01
frameworkgroup: C1[X(C13H13NO)]
method: RPBEPBE
basis: SDD
operation: Freq
keyword: #p
keyword: freq=noraman
keyword: PBEPBE/SDD
title: #p freq=noraman PBEPBE/SDD
converged: YES YES NO NO
title: Mulliken charges:
elementType: O N C C C C C C C C C C C C C H H H H H H H H H H H H H
charge: -0.271839 -0.065188 -0.529567 0.069626 -0.336067 0.316342 -0.287625 -0.295259 0.253084 -0.389846 -0.377960 -0.201673 -0.216026 -0.257366 -0.536248 0.254764 0.250077 0.236524 0.273157 0.250433 0.247009 0.252114 0.224122 0.223172 0.226306 0.221149 0.245103 0.221681
chargesum: 0.00000
title: Mulliken charges with hydrogens summed into heavy atoms:
elementType: O N C C C C C C C C C C C C C
charge: -0.271839 -0.065188 -0.024726 0.069626 -0.099543 0.316342 -0.014468 -0.044826 0.253084 -0.142837 -0.125845 0.022449 0.007146 -0.031060 0.151686
polarizability: 2.83369046e+02 -8.70951402e+00 1.30731319e+02 -9.97647990e+00 -5.62430684e+00 9.18758739e+01
1716.lowfreq: -3.9894 -0.0007 -0.0002 0.0005 2.2492 8.7594 25.5626 53.0984 73.9906
frequency: 25.2760 53.0967 73.9737 95.6303 129.8393 189.5508 194.9958 227.4301 259.9333 305.9383 311.3738 367.2819 408.1170 428.2180 478.4520 507.4692 523.0271 572.3453 610.3611 619.0628 646.1284 695.9944 703.7118 739.2123 768.6365 772.5068 815.3059 831.7159 839.1620 900.9380 915.5952 943.4530 964.1828 980.9921 982.2171 983.4031 989.1157 1020.8204 1040.6428 1076.4135 1115.7380 1154.6516 1161.1400 1167.3754 1173.5495 1176.9893 1191.0223 1206.9191 1271.7478 1305.8169 1314.3129 1332.2503 1369.1910 1410.0975 1420.9220 1436.6672 1439.7742 1461.8366 1466.9965 1473.7522 1569.2215 1572.8669 1589.9206 1605.9148 1647.6610 2955.6248 2956.6613 3007.3043 3042.0839 3120.9331 3127.4884 3128.9847 3140.0379 3142.6759 3151.2499 3154.0284 3164.6394 3166.8774
redmass: 3.7572 4.4291 3.8051 3.9646 3.1612 3.0344 1.7119 4.3356 1.4274 4.7341 4.1330 4.9123 2.9639 4.6156 2.8402 2.8394 5.1027 5.4855 6.2638 5.6347 3.6167 2.0194 4.0535 3.8951 1.2804 2.2042 1.6168 5.1898 1.2638 1.4799 2.2315 3.2395 1.3659 5.9508 2.5426 1.8512 1.3235 2.1371 1.8213 1.5502 1.2677 1.4434 1.1937 1.0756 1.2205 1.1106 3.2870 2.9319 1.7654 1.3997 2.1559 1.9306 5.3897 1.6929 1.1607 2.3490 1.3315 1.0496 2.2439 1.0567 7.3512 6.5550 8.4358 6.4129 6.2130 1.0638 1.0355 1.0910 1.1035 1.0846 1.0993 1.0874 1.0872 1.0927 1.0912 1.0954 1.0980 1.1009
irintensity: 0.0335 0.7763 2.3639 1.6914 13.1761 2.4392 1.1226 1.7302 0.3914 0.4530 1.9062 5.0533 1.9557 2.6415 8.6838 8.8064 10.9549 2.5793 0.4520 1.1285 2.3408 47.1332 5.5336 67.4753 36.9771 43.9306 38.9288 0.6796 6.2473 6.7797 0.8895 7.7850 1.1406 28.7229 7.7861 4.3091 0.6560 7.9580 25.4638 13.8284 0.0696 17.3397 11.5626 1.4178 14.9621 2.9240 162.3514 13.3696 0.9902 0.4674 23.7349 3.8610 1.3320 43.9721 16.2390 2.1514 10.2767 14.6496 31.8238 27.9968 235.6362 120.2899 7.7356 4.0176 52.5891 14.6113 50.3163 6.6377 49.2887 7.4586 28.5350 3.7412 3.4461 23.5448 19.2892 29.9098 6.7900 25.3287
temp: 298.150 k
press: 1.00000 atm
elementType: 8 7 6 6 6 6 6 6 6 6 6 6 6 6 6 1 1 1 1 1 1 1 1 1 1 1 1 1
symmnumber: 1
zpe: 587883.5 jmol-1
zpe.correction: 0.223913 hartree
zpe.thermalcorrener: 0.237253 hartree
zpe.thermalcorrenthalpy: 0.238197 hartree
zpe.thermalcorrgfe: 0.182864 hartree
zpe.sumelectzpe: -632.034684 hartree
zpe.sumelectthermal: -632.021344 hartree
zpe.sumelectthermalent: -632.020400 hartree
zpe.sumelectthermalfe: -632.075733 hartree
dipole: -3.0260 -0.1316 0.1850
dipole: 3.0345
quadrupole: -69.3337 -86.7971 -88.9461
quadrupole: -9.1805 -4.5784 -2.6225
quadrupole: 12.3586 -5.1048 -7.2538 -9.1805 -4.5784 -2.6225
hfenergy: -632.2585974 hartree
pointgroup: C01 [X(C13H13N1O1)]
dipole: -1.1904271 -0.0140819 0.0896786 debye
polarizability: 283.7417865|-10.248173|109.6894195|-2.0925831|-20.2181239|112.5450336 unknown
InChI: InChI=1S/C13H13NO/c1-15-13-9-7-12(8-10-13)14-11-5-3-2-4-6-11/h2-7,9-10H,8H2,1H3
charge 0 multiplicity 1
28 atoms
O  -4.296925 -1.170606 0.218918
N  0.816125 0.99177 -0.653542
C  -1.574316 1.417327 -0.613189
C  -0.374492 0.500723 -0.360172
C  -2.946571 0.801588 -0.448543
C  -3.089271 -0.48509 0.002213
C  -0.640739 -0.854736 0.143348
C  -1.923794 -1.320416 0.297208
C  2.043981 0.369742 -0.323711
C  3.043764 0.265933 -1.333192
C  2.365846 -0.04374 1.004133
C  4.309866 -0.275211 -1.032695
C  3.644918 -0.56104 1.300659
C  4.621056 -0.69174 0.285117
C  -5.528382 -0.430137 -0.058196
H  -1.46679 1.862533 -1.622154
H  -1.477829 2.280807 0.079795
H  -3.80905 1.431971 -0.689238
H  0.211446 -1.515336 0.332397
H  -2.122401 -2.347228 0.624736
H  2.803281 0.614911 -2.342697
H  1.622496 0.081013 1.800216
H  5.062125 -0.360741 -1.825317
H  3.880284 -0.86011 2.328783
H  5.611753 -1.096707 0.518309
H  -5.604091 0.470002 0.583471
H  -6.3474 -1.12627 0.173702
H  -5.579991 -0.127411 -1.122758
