program: Gaussian 09
title: 000290966
version: EM64L-G09RevD.01
frameworkgroup: C1[X(C11H13N)]
method: RPBEPBE
basis: SDD
operation: Freq
keyword: #pfreq=noraman
keyword: PBEPBE/SDD
title: #p freq=noraman PBEPBE/SDD
converged: YES YES NO NO
title: Mulliken charges:
elementType: N C C C C C C C C C C C H H H H H H H H H H H H H
charge: -0.118829 -0.236067 0.367320 0.364403 -0.698306 -0.176242 -0.440294 -0.433536 -0.617147 -0.432409 -0.258994 -0.236211 0.212320 0.240943 0.229713 0.209183 0.223388 0.227554 0.227923 0.224561 0.228971 0.220931 0.227619 0.222170 0.221034
chargesum: 0.00000
title: Mulliken charges with hydrogens summed into heavy atoms:
elementType: N C C C C C C C C C C C
charge: -0.118829 -0.023747 0.367320 0.364403 -0.018467 0.047146 -0.212740 -0.205613 0.057316 -0.204791 -0.036824 -0.015176
polarizability: 1.82929037e+02 2.67467787e+00 1.25336034e+02 -1.61243795e-01 9.63546613e+00 7.19299183e+01
1716.lowfreq: -13.8589 -0.0007 -0.0007 -0.0005 4.4734 11.2064 64.3371 98.7673 121.4587
frequency: 64.3140 98.7291 121.4255 182.7190 190.5233 225.7974 275.5372 300.1765 374.5798 393.2078 416.9866 482.2016 513.3756 526.1684 582.6368 613.7939 705.9655 724.2080 736.1541 755.1539 778.4309 815.5579 852.8324 872.7596 906.2443 939.1496 970.1506 976.4834 1025.4181 1030.6406 1055.6558 1073.7632 1112.9475 1118.3467 1156.1423 1170.6283 1194.1907 1205.8814 1228.6873 1264.3899 1301.3435 1317.0700 1357.9468 1370.7907 1379.7106 1419.2075 1435.6115 1459.3334 1461.4912 1467.0774 1472.4684 1486.6002 1500.6609 1569.7171 1610.3839 1628.8681 2935.6095 2974.3706 2981.3621 3018.2951 3077.9861 3084.0942 3093.0882 3107.0374 3117.5978 3135.5639 3136.0087 3157.7569 3173.5581
redmass: 2.5797 1.8417 2.0312 2.0227 3.3317 1.0698 3.0665 3.1021 3.8412 3.7011 3.4433 3.1780 4.7841 3.5924 3.6568 4.4424 4.4845 1.3597 3.1178 1.6794 2.0288 3.0550 2.8826 1.5033 1.3098 1.4003 3.1846 1.3391 1.5971 2.2053 2.1237 1.8223 1.3641 1.6489 1.3456 1.0771 2.2756 2.0957 2.0489 1.8516 1.3461 1.7883 1.4652 1.2214 5.8871 1.7162 1.5523 1.2025 1.4056 1.0644 1.1051 1.8728 1.5576 5.8612 6.4961 6.0228 1.0433 1.0834 1.0364 1.0918 1.0997 1.0982 1.1007 1.0877 1.0873 1.0898 1.0917 1.1002 1.0969
irintensity: 1.4028 1.2144 1.2681 0.4789 4.3870 0.0855 0.5783 0.6700 2.6851 1.4290 18.7597 12.1749 2.8573 3.7690 1.6580 0.3436 0.7815 5.4982 2.3773 63.4453 72.8738 6.3820 1.7540 5.7274 0.7911 5.8216 10.4830 0.7761 28.3162 7.2396 14.3622 8.7157 21.3337 5.0399 5.3189 2.7010 55.2010 2.0263 7.9353 1.0150 11.7742 48.6343 30.5690 20.5410 1.6602 28.3503 12.8106 10.8215 29.9367 15.2591 7.9620 12.5688 38.9707 35.6394 59.2451 157.2464 135.4098 35.9505 33.8661 40.3026 36.1945 16.2904 19.7260 14.4920 4.5542 22.5852 18.8580 37.2977 19.3796
temp: 298.150 k
press: 1.00000 atm
elementType: 7 6 6 6 6 6 6 6 6 6 6 6 1 1 1 1 1 1 1 1 1 1 1 1 1
symmnumber: 1
zpe: 551852.7 jmol-1
zpe.correction: 0.210190 hartree
zpe.thermalcorrener: 0.220982 hartree
zpe.thermalcorrenthalpy: 0.221926 hartree
zpe.thermalcorrgfe: 0.174039 hartree
zpe.sumelectzpe: -480.837467 hartree
zpe.sumelectthermal: -480.826675 hartree
zpe.sumelectthermalent: -480.825731 hartree
zpe.sumelectthermalfe: -480.873618 hartree
dipole: 2.4991 -0.7798 -0.2374
dipole: 2.6286
quadrupole: -61.2790 -66.1751 -76.5690
quadrupole: -0.2999 -1.7918 2.1792
quadrupole: 6.7287 1.8326 -8.5613 -0.2999 -1.7918 2.1792
hfenergy: -481.047657 hartree
pointgroup: C01 [X(C11H13N1)]
dipole: -0.9786862 -0.3157401 0.1096234 debye
dipolederiv: -0.6093374 -0.016122 0.0893278 -0.9877717 -0.7158197 0.0547185 0.6437633 0.1083559 -0.4742507 0.042456 -0.1059656 -0.0000276 0.064571 0.4939069 0.165086 -0.0467358 0.1253803 0.4629914 -0.0133377 0.0068429 0.0675882 0.3639554 -0.1457777 -0.0051234 -0.0703866 0.0086344 -0.1114206 0.5497039 -0.274023 0.0036452 -0.6119227 0.0995808 0.0251489 0.0858147 0.0078488 0.0643365 0.0597339 -0.0258282 -0.0705442 -0.055267 -0.071508 -0.0897734 -0.018992 -0.129741 -0.1686544 0.6314168 0.2123457 -0.1089149 1.0587448 0.5068034 -0.247547 -0.5248595 -0.2079927 0.0038175 -0.8665336 -0.0227058 0.037556 0.0853242 -0.1014236 -0.0938147 0.1969009 -0.0365115 -0.3507572 0.0873086 0.0420471 0.0097797 -0.0823725 0.0767231 -0.0722254 0.0013947 -0.0745221 -0.1380174 0.7606586 0.1509676 -0.074433 0.2133128 0.1556519 -0.0214765 -0.1650213 -0.0257915 0.3076713 -0.3152309 0.1880359 -0.0133825 0.0536255 0.0758747 -0.0853449 -0.010698 -0.0565342 -0.1684377 -0.1769706 -0.0743591 0.0099313 0.0116669 -0.1011573 -0.0662838 0.0084504 -0.0322994 -0.1707055 0.1763209 -0.0149961 -0.0038935 0.0217242 0.0671131 -0.0398927 0.017313 -0.0685662 -0.1449655 0.0328442 -0.0218698 0.0328036 -0.0550538 -0.0828111 0.0798237 0.0513951 0.0917102 -0.0943313 0.0774592 -0.024676 0.0259022 -0.0006552 -0.0048269 0.1300195 0.0214576 0.0537643 -0.0079622 0.0028453 0.1290102 0.0316804 0.0757138 -0.0381907 -0.0409373 -0.0143082 -0.0197793 0.0775312 -0.1748726 -0.1255453 -0.0515585 -0.0843632 0.0598512 -0.0192752 -0.0203008 -0.0203869 0.0553146 -0.0585015 0.1266404 0.013206 0.0712159 0.0064869 0.0181477 -0.0509338 0.0115224 0.1645748 0.040692 -0.0471036 0.0252564 0.0174722 -0.0833332 0.0806631 -0.013056 0.0712485 0.1699137 0.0680084 -0.0791806 0.0277899 -0.0289109 -0.1028032 0.0648992 -0.0030781 0.0613574 0.123478 -0.0056343 0.0418029 0.0466273 0.1554365 -0.0667915 -0.0851745 0.0391831 -0.0376516 0.0919645 0.0198132 0.0155138 -0.0338755 -0.1047942 -0.0110407 0.1565868 0.0608634 0.115823 -0.0618597 -0.1946971 -0.0988213 -0.0242734 -0.1639102 0.0192175 -0.0567374 -0.1742495 -0.0926034 -0.0646492 0.0683551 -0.01702 -0.0014468 -0.0614599 -0.1116623 0.0699743 0.0192228 0.0633911 0.1375564 -0.0500376 0.0983267 -0.0448393 0.1161646 -0.0005931 0.0576084 -0.0398993 0.0621521 0.1464645 -0.1524628 -0.0633166 0.0060952 -0.0724466 0.0765294 0.0209302 0.0067596 0.0211914 0.1503969 unknown
polarizability: 182.9920256|-1.8938601|124.2729337|-0.1171184|-12.0473598|72.9300302 unknown
InChI: InChI=1S/C11H13N/c1-9-11-6-4-3-5-10(11)7-8-12(9)2/h3-9H,1-2H3
charge 0 multiplicity 1
25 atoms
N  -2.052507 0.115037 0.360273
C  -1.11603 -1.004241 0.06115
C  0.334719 -0.526582 0.158905
C  0.647282 0.822406 -0.208009
C  -1.399042 -1.610685 -1.346938
C  -1.732788 1.392451 -0.08151
C  -0.448726 1.759439 -0.429856
C  1.368314 -1.4228 0.499848
C  -3.410855 -0.230537 0.786786
C  2.015387 1.214412 -0.259856
C  2.724445 -1.019754 0.450539
C  3.042967 0.302655 0.057257
H  -1.296086 -1.790922 0.822046
H  -1.239653 -0.845277 -2.126795
H  -0.707071 -2.449315 -1.541098
H  -2.43518 -1.989045 -1.425809
H  -2.558567 2.112086 -0.09815
H  -0.245705 2.783024 -0.754273
H  1.117851 -2.45105 0.792598
H  -3.946663 0.679857 1.104869
H  -3.372624 -0.919954 1.651885
H  -4.004829 -0.720028 -0.014408
H  2.263105 2.246686 -0.536269
H  3.519967 -1.727152 0.708895
H  4.090593 0.621888 0.009425
