program: Gaussian 09
title: 000290964
version: EM64L-G09RevD.01
frameworkgroup: C1[X(C13H18O2)]
method: RPBEPBE
basis: SDD
operation: Freq
keyword: #pfreq=noraman
keyword: PBEPBE/SDD
title: #p freq=noraman PBEPBE/SDD
converged: YES YES NO NO
title: Mulliken charges:
elementType: O O C C C C C C C C C C C C C H H H H H H H H H H H H H H H H H H
charge: -0.177908 -0.226684 0.141330 0.321376 -0.686004 0.529142 -0.581848 -0.492500 0.120171 -0.767405 -0.547752 -0.714993 -0.729245 -0.560803 0.180265 0.224899 0.239757 0.251952 0.229982 0.244242 0.218847 0.240369 0.239602 0.223871 0.252605 0.243214 0.237826 0.213635 0.217172 0.222262 0.210545 0.222651 0.259428
chargesum: 0.00000
title: Mulliken charges with hydrogens summed into heavy atoms:
elementType: O O C C C C C C C C C C C C C
charge: -0.177908 -0.226684 0.141330 0.321376 -0.221348 0.529142 -0.099914 -0.029410 0.120171 -0.063563 -0.051933 -0.046360 -0.073788 -0.301375 0.180265
polarizability: 1.71654275e+02 1.05255923e+01 1.37253022e+02 6.93293771e+00 -2.15784693e+00 1.16102002e+02
1716.lowfreq: -14.2932 -11.3630 -0.0007 -0.0004 0.0008 8.7234 50.0340 62.1487 90.7506
frequency: 49.9198 62.1346 90.7463 141.8175 183.3201 198.2425 203.0263 224.5153 233.6553 247.7135 270.4946 312.7242 323.1999 350.2208 369.2404 388.0516 392.7349 425.8359 449.6967 485.6085 492.8182 536.9923 600.5706 603.8753 613.1179 661.9407 693.6674 749.7482 780.9047 831.6490 874.6322 885.4689 895.8849 915.4719 925.1418 935.8926 939.8924 969.0727 990.9644 1011.5172 1031.2543 1053.8069 1073.4135 1106.0775 1115.0954 1137.2798 1160.8723 1172.8010 1182.8608 1217.0836 1232.4478 1245.0417 1273.3405 1275.5744 1286.4199 1306.6922 1322.7411 1338.6576 1350.7600 1379.6685 1385.0572 1398.5521 1439.7836 1447.7370 1451.0839 1458.6806 1462.1363 1469.3678 1478.2492 1480.1178 1483.6013 1488.7454 1588.7520 1609.8682 1635.9779 2968.8908 2974.7141 2978.0461 2983.1888 2986.8829 2989.2313 2996.3593 3048.5701 3060.5064 3063.0166 3066.8369 3069.0367 3072.8256 3076.2082 3078.5969 3083.8270 3100.6510 3122.7951
redmass: 5.4883 4.5897 4.0832 3.1783 2.0061 2.1495 1.1173 1.7331 2.8970 1.1584 2.0522 2.5247 2.6090 2.4866 4.5567 2.6174 2.4998 2.6578 3.1286 3.3065 2.9718 3.4966 3.0868 4.4884 3.9327 3.6895 3.8604 2.1791 3.1391 2.6769 1.6471 2.3713 1.7957 1.8865 1.7576 1.4575 1.9555 1.6933 1.6711 1.4033 2.5077 2.1084 2.3198 1.8753 1.7208 2.4168 1.8018 1.6390 2.0439 1.9627 1.8032 2.1734 1.6246 2.1351 1.8397 1.7830 1.3471 2.2821 1.4317 1.1987 1.2221 1.2027 1.0807 1.0784 1.0879 1.0780 1.0493 1.0579 1.0641 1.0553 1.0548 1.0624 10.0047 8.8800 8.9549 1.0358 1.0581 1.0436 1.0551 1.0653 1.0400 1.0600 1.1002 1.0974 1.0984 1.0992 1.0997 1.0975 1.0988 1.0992 1.1005 1.0985 1.0914
irintensity: 3.1322 0.3477 1.5915 4.0291 0.7926 1.7321 0.4551 0.5817 0.3343 0.0571 0.2021 5.5174 0.7971 0.3601 3.9839 4.8322 0.3946 1.1522 1.9258 3.7954 2.5351 4.8592 2.8957 9.6532 7.3688 0.5595 0.6745 12.5395 6.2530 3.1498 8.4375 1.2484 6.5238 8.6089 2.0353 2.2627 3.3724 10.3782 7.6639 1.6201 2.9999 7.9402 28.0259 2.0888 2.5422 6.3040 16.2018 14.1703 48.6261 19.9589 44.5347 18.7823 7.2926 28.0017 4.5416 27.7722 5.0689 21.0206 2.2795 17.1816 10.9346 15.6134 16.6901 18.0696 19.2580 6.3378 3.9969 7.0869 18.7538 10.9088 14.6393 3.7794 144.0420 189.0673 132.4807 29.7208 21.1641 18.6470 16.2444 9.7756 19.7935 46.2527 12.9623 5.0235 10.6949 44.0357 5.5396 20.3495 52.7569 39.1729 16.6265 30.2833 7.9629
temp: 298.150 k
press: 1.00000 atm
elementType: 8 8 6 6 6 6 6 6 6 6 6 6 6 6 6 1 1 1 1 1 1 1 1 1 1 1 1 1 1 1 1 1 1
symmnumber: 1
zpe: 733142.8 jmol-1
zpe.correction: 0.279239 hartree
zpe.thermalcorrener: 0.294031 hartree
zpe.thermalcorrenthalpy: 0.294975 hartree
zpe.thermalcorrgfe: 0.238705 hartree
zpe.sumelectzpe: -655.478903 hartree
zpe.sumelectthermal: -655.464112 hartree
zpe.sumelectthermalent: -655.463168 hartree
zpe.sumelectthermalfe: -655.519438 hartree
dipole: 5.0296 1.1684 2.5920
dipole: 5.7776
quadrupole: -99.5755 -96.5271 -92.7485
quadrupole: -12.1489 -0.1822 5.3559
quadrupole: -3.2919 -0.2434 3.5352 -12.1489 -0.1822 5.3559
hfenergy: -655.7581427 hartree
pointgroup: C01 [X(C13H18O2)]
dipole: 1.9688654 -0.294817 -1.0970894 debye
polarizability: 172.0126742|-8.5610258|136.7514881|-8.9724327|-0.460593|116.2451364 unknown
InChI: InChI=1S/C13H18O2/c1-12(2)7-9-6-10(14)4-5-13(9,3)11(15)8-12/h6H,4-5,7-8H2,1-3H3
charge 0 multiplicity 1
33 atoms
O  0.353678 -2.131436 1.491047
O  -3.492147 1.740373 0.410226
C  -0.333586 -0.965892 -0.573211
C  2.18839 0.691681 0.111644
C  1.168646 1.08406 -1.022181
C  -0.211634 0.559125 -0.693105
C  2.109434 -0.850031 0.376371
C  -1.777783 -1.429449 -0.245526
C  0.685585 -1.386597 0.53417
C  0.095752 -1.666356 -1.908549
C  -2.533989 -0.498442 0.724717
C  1.854285 1.457229 1.418084
C  3.621311 1.054635 -0.349861
C  -1.251763 1.399139 -0.386634
C  -2.518923 0.946373 0.23207
H  1.539738 0.672251 -1.981549
H  1.150849 2.18476 -1.121999
H  2.679386 -1.116119 1.284289
H  2.582622 -1.382279 -0.474619
H  -1.731542 -2.447694 0.179648
H  -2.343464 -1.487754 -1.195661
H  -0.048721 -2.757737 -1.812812
H  -0.543002 -1.304926 -2.734022
H  1.146926 -1.483552 -2.184345
H  -2.054569 -0.527524 1.723979
H  -3.580969 -0.821051 0.858162
H  0.840757 1.221068 1.788287
H  1.906573 2.549501 1.254024
H  2.575751 1.1973 2.214193
H  3.715311 2.143231 -0.520453
H  3.8845 0.537628 -1.292109
H  4.366041 0.768819 0.416079
H  -1.149945 2.483068 -0.526352
