program: Gaussian 09
title: 000290961
version: EM64L-G09RevD.01
frameworkgroup: C1[X(C11H16O2)]
method: RPBEPBE
basis: SDD
operation: Freq
keyword: #pfreq=noraman
keyword: PBEPBE/SDD
title: #p freq=noraman PBEPBE/SDD
converged: YES YES NO NO
title: Mulliken charges:
elementType: O O C C C C C C C C C C C H H H H H H H H H H H H H H H H
charge: -0.190240 -0.190239 -0.118277 -0.118315 -0.526181 -0.482701 -0.482692 -0.431044 -0.431055 0.104468 0.104462 -0.502071 -0.502089 0.257180 0.257183 0.245199 0.245182 0.228554 0.216762 0.228545 0.216767 0.213071 0.226576 0.213084 0.226569 0.253962 0.241685 0.253972 0.241684
chargesum: 0.00000
title: Mulliken charges with hydrogens summed into heavy atoms:
elementType: O O C C C C C C C C C C C
charge: -0.190240 -0.190239 0.138903 0.138868 -0.035800 -0.037384 -0.037380 0.008602 0.008597 0.104468 0.104462 -0.006423 -0.006434
polarizability: 1.38828729e+02 -2.46833010e-03 1.06070702e+02 -3.32887988e+00 1.56443859e-04 1.00983648e+02
1716.lowfreq: -7.6799 -5.4552 -0.0007 0.0002 0.0005 5.4109 33.6416 48.9732 69.5339
frequency: 33.5497 48.5913 69.4897 90.7872 91.8954 184.5336 190.2500 209.9028 246.0236 336.7716 382.2638 456.5645 490.0340 506.8397 534.6214 555.1691 563.8555 601.7843 626.1217 716.8187 744.0715 811.1515 825.1349 836.3698 883.4426 907.7685 909.2910 927.1912 931.4233 943.0659 981.1486 1014.1559 1028.0856 1041.4482 1067.7285 1110.8697 1122.7344 1147.8120 1149.1716 1154.2249 1160.6768 1176.8577 1194.5900 1204.6559 1227.3888 1243.2020 1263.5249 1268.5446 1269.5988 1276.5835 1298.0118 1302.2844 1302.9163 1317.7951 1320.6028 1333.2583 1430.6837 1430.7569 1465.4357 1473.6349 1475.7662 1482.1499 1482.6619 1652.4963 1656.0838 2935.1419 2936.5027 2982.6140 2987.2147 2987.2347 2989.1253 2989.6926 3001.6020 3001.7831 3045.4872 3061.6682 3062.0833 3068.7487 3068.9504 3080.1800 3080.2692
redmass: 5.0073 3.4323 2.6623 5.2249 3.0145 2.7822 2.2361 3.2252 2.7118 2.7287 1.9959 4.1055 2.5854 4.0218 2.5509 4.0156 2.5349 2.4520 3.3343 3.2923 2.2280 1.6211 1.9238 1.9576 1.9780 1.8490 2.0102 2.0051 2.3681 1.3718 1.5096 1.6257 2.1514 2.1195 1.4015 2.4034 2.2699 1.8291 2.5026 2.5899 1.4804 1.7192 1.4251 1.4326 1.6147 1.2822 1.3036 1.3851 1.3857 1.4268 1.2728 1.3526 1.2961 1.5574 1.5502 1.5765 1.0801 1.0801 1.0806 1.0837 1.0824 1.0958 1.0960 12.2308 12.4830 1.0799 1.0803 1.0595 1.0654 1.0655 1.0638 1.0641 1.0643 1.0645 1.1021 1.0992 1.0991 1.0960 1.0959 1.1024 1.1026
irintensity: 2.8757 2.5036 0.3536 0.9506 2.9132 0.6713 5.7155 0.0953 6.3392 0.1777 0.7941 18.2605 0.4441 1.2916 4.9705 2.7618 3.9994 0.5568 3.4780 1.7011 0.0755 1.3740 32.3166 6.0324 0.2833 2.3070 1.1404 32.8763 0.2415 4.7607 1.8374 12.8993 1.4953 3.9005 0.6509 34.9807 0.0052 62.9582 105.5597 4.0019 0.5103 0.1437 10.7331 0.2992 0.2550 17.8258 2.5734 9.5810 3.8846 3.3830 0.0834 0.7339 2.0694 4.1916 1.2022 12.0533 36.9537 6.2840 9.8519 15.4908 9.1360 5.1981 2.9530 146.4980 170.3758 17.2817 1.3972 8.6666 15.9693 10.4623 0.9676 53.7122 27.9049 44.4215 20.3624 4.2692 52.7542 36.0383 0.5720 69.0079 12.7141
temp: 298.150 k
press: 1.00000 atm
elementType: 8 8 6 6 6 6 6 6 6 6 6 6 6 1 1 1 1 1 1 1 1 1 1 1 1 1 1 1 1
symmnumber: 1
zpe: 648738.5 jmol-1
zpe.correction: 0.247091 hartree
zpe.thermalcorrener: 0.259670 hartree
zpe.thermalcorrenthalpy: 0.260614 hartree
zpe.thermalcorrgfe: 0.206722 hartree
zpe.sumelectzpe: -578.212418 hartree
zpe.sumelectthermal: -578.199839 hartree
zpe.sumelectthermalent: -578.198895 hartree
zpe.sumelectthermalfe: -578.252788 hartree
dipole: -0.0009 4.7646 0.0000
dipole: 4.7646
quadrupole: -72.4631 -85.3440 -83.5689
quadrupole: 0.0017 -11.5564 -0.0002
quadrupole: 7.9956 -4.8853 -3.1102 0.0017 -11.5564 -0.0002
hfenergy: -578.4595095 hartree
pointgroup: C01 [X(C11H16O2)]
dipole: -0.0049412 -1.8745126 -0.001664 debye
polarizability: 138.6576017|-0.0807741|106.0708978|4.1858056|-0.0056408|101.1545793 unknown
InChI: InChI=1S/C11H16O2/c12-10-5-1-3-8(10)7-9-4-2-6-11(9)13/h8-9H,1-7H2
charge 0 multiplicity 1
29 atoms
O  -2.480307 1.519578 1.413772
O  2.480109 1.509975 -1.411355
C  -1.283782 -0.269963 0.167344
C  1.274454 -0.276022 -0.168655
C  -0.002553 0.57386 0.000161
C  -1.77724 -1.048168 -1.0803
C  1.763714 -1.059191 1.077543
C  -3.305119 -1.234578 -0.8440
C  3.290811 -1.252315 0.841589
C  -2.506471 0.579696 0.583409
C  2.501414 0.568405 -0.582764
C  -3.747123 0.092768 -0.180966
C  3.739359 0.074215 0.181328
H  -1.131308 -0.99213 1.00187
H  1.118455 -0.995669 -1.004688
H  -0.106518 1.23564 -0.881802
H  0.104727 1.233319 0.883469
H  -1.256971 -2.010748 -1.22603
H  -1.605612 -0.43526 -1.9874
H  1.238826 -2.019606 1.220971
H  1.594512 -0.4474 1.985854
H  -3.479504 -2.080021 -0.151425
H  -3.85205 -1.451583 -1.777193
H  3.461584 -2.097237 0.147484
H  3.83626 -1.473666 1.774629
H  -4.622068 0.01773 0.487266
H  -3.991338 0.859126 -0.944896
H  4.614312 -0.003621 -0.486572
H  3.986729 0.837965 0.946858
