program: Gaussian 09
title: 000028083
version: EM64L-G09RevD.01
frameworkgroup: C1[X(C21H27BrClNO)]
method: RPBEPBE
basis: SDD
operation: Freq
keyword: #p
keyword: freq=noraman
keyword: PBEPBE/SDD
title: #p freq=noraman PBEPBE/SDD
converged: YES YES NO NO
title: Mulliken charges:
elementType: Br Cl O N C C C C C C C C C C C C C C C C C C C C C H H H H H H H H H H H H H H H H H H H H H H H H H H H
charge: 0.009045 -0.072948 -0.283409 -0.134387 -0.419035 -0.224248 -0.525385 0.386098 -0.283274 -0.323839 0.174819 0.481759 -0.380747 -0.696400 -0.698557 -0.509109 0.473533 -0.580331 -0.476037 -0.359412 -0.444210 -0.817654 -0.180922 -0.172015 -0.221023 0.224636 0.246164 0.249801 0.218052 0.233098 0.225174 0.205340 0.235031 0.233547 0.228865 0.228105 0.209497 0.208025 0.206971 0.210106 0.226189 0.245015 0.265156 0.267656 0.228486 0.257149 0.241566 0.227399 0.225428 0.228379 0.250918 0.251936
chargesum: 0.00000
title: Mulliken charges with hydrogens summed into heavy atoms:
elementType: Br Cl O N C C C C C C C C C C C C C C C C C C C C C
charge: 0.009045 -0.072948 -0.283409 -0.134387 0.051765 0.025553 -0.074235 0.386098 0.147240 0.144739 0.174819 0.481759 -0.151882 -0.050773 -0.055292 -0.264094 0.473533 -0.047519 -0.247550 -0.102263 -0.202644 -0.136448 0.069996 0.079921 -0.221023
polarizability: 2.63550562e+02 2.29283971e+01 2.78483096e+02 1.08212919e+01 -1.59931328e+00 2.58991939e+02
1716.lowfreq: -22.6216 -7.9178 -2.3258 -0.0013 -0.0013 -0.0004 1.6304 8.8346 11.0106
frequency: -22.4622 8.5120 10.8851 22.0304 24.2367 28.6549 32.7444 49.0885 56.2707 77.0686 82.3897 88.7139 124.7842 136.1615 155.9790 163.9867 194.5848 203.1790 204.9866 216.4465 222.8572 225.8240 245.0196 255.3485 260.7344 285.1644 313.0408 335.5048 352.2526 388.6414 392.3223 407.1071 411.5750 434.6272 470.6327 482.0349 487.1934 517.2885 571.0575 579.9356 596.2324 623.9008 635.0637 667.1432 691.9204 707.8413 731.0820 747.4452 772.9612 796.1556 812.7199 823.7667 826.2119 839.6862 853.2129 862.1292 884.7663 918.0294 920.7095 948.0231 949.1549 954.9880 975.8484 987.0796 991.9180 996.3441 1001.2969 1011.8616 1044.3680 1046.5078 1057.8434 1058.8222 1068.5220 1088.5654 1096.0669 1107.2152 1108.0661 1114.1198 1148.0411 1157.9073 1166.0774 1179.0991 1192.7124 1208.5732 1213.3923 1236.5217 1253.2775 1254.6706 1259.5735 1281.3841 1281.7989 1292.8995 1300.5771 1321.5303 1325.3313 1339.7459 1352.0576 1362.2484 1375.2736 1380.0252 1387.6522 1391.7868 1394.1571 1397.8655 1400.7564 1405.2700 1451.7820 1463.8756 1465.9783 1467.5799 1468.7846 1471.0665 1472.8818 1475.6575 1477.9018 1478.5358 1482.6547 1487.2227 1504.9896 1582.8657 1588.7221 1597.9536 1616.9947 2877.3819 2927.4653 2943.3823 2949.2788 2970.8282 2973.8201 2974.6076 2995.6639 3016.3819 3029.8462 3051.0976 3054.9924 3060.2338 3062.5506 3066.1242 3072.7211 3075.0899 3080.8554 3085.1147 3116.7581 3124.9884 3139.3319 3141.4637 3144.1017 3146.5431 3166.9512 3170.1120
redmass: 2.6461 4.6898 6.9371 6.7668 8.3353 1.1042 3.7232 5.5212 4.6064 4.7134 2.5564 3.4628 3.9717 5.2705 2.2152 3.3021 5.3848 1.4121 3.3028 3.2348 2.0513 2.0097 2.0071 2.7349 4.2234 3.1330 3.4634 3.7769 3.0495 3.0212 3.2608 2.9865 3.0044 3.5856 3.8111 3.4088 3.3576 3.3152 3.3804 6.3806 3.4014 6.8913 5.4685 5.9372 3.6961 3.6915 5.1330 3.3280 1.1719 2.5758 1.2683 1.3191 1.6988 1.2632 3.1292 1.5487 2.6212 1.1862 3.7404 1.4027 1.4170 1.3949 1.5216 1.7552 2.5097 3.4373 1.6253 2.2502 2.3758 1.5469 1.6970 2.5164 2.8793 2.5507 2.4174 1.4012 1.6012 2.6922 1.7368 2.0042 1.5140 1.1219 1.2752 2.5191 1.5862 1.3706 1.4847 2.6868 1.6732 1.5975 1.1659 1.2307 1.3026 1.5945 1.3216 1.4430 2.0092 1.3444 1.1962 3.5422 2.1422 1.7720 1.3027 1.4587 1.7927 2.7295 1.0971 1.3527 1.0446 1.0521 1.1183 1.0465 1.5410 1.1068 1.1160 1.0631 1.1364 1.0880 2.4375 7.3026 6.1448 6.1652 6.6626 1.0702 1.0692 1.0686 1.0577 1.0349 1.0354 1.0372 1.0880 1.1026 1.0856 1.0977 1.0872 1.0634 1.1000 1.0939 1.0983 1.1003 1.0988 1.0982 1.0869 1.0899 1.0922 1.0886 1.0943 1.1117 1.0952 1.0960
irintensity: 0.0055 0.0766 0.0482 0.6815 0.7508 0.3158 0.0525 0.3606 0.4114 0.0214 1.8964 1.4956 1.7766 0.7389 2.3522 2.1908 3.0583 0.3174 3.5479 0.2536 0.7652 1.3012 1.6262 0.7145 1.1597 0.2089 2.7663 4.0618 2.2924 9.1169 0.6279 0.5728 1.9771 3.1679 10.9125 23.3387 4.9605 2.2899 3.9214 6.1730 9.1433 0.3938 32.7900 85.9908 0.0628 2.1562 10.0934 0.8934 12.9919 20.5874 20.9386 27.6601 50.3733 4.9580 13.5831 5.6625 1.1613 2.3096 7.1378 5.7594 0.3071 0.2056 4.1732 17.1964 51.3812 71.0270 2.3767 60.5825 19.1905 14.2170 42.0751 23.4842 37.3014 10.1352 64.1572 6.9405 25.6292 2.1689 10.9588 70.5408 0.7891 2.3574 8.5230 0.7107 9.5924 29.5391 9.2312 143.9249 3.9923 22.1148 8.4592 8.9806 8.9430 14.5438 2.4701 2.3768 16.4803 0.7627 16.1036 4.1472 2.1512 5.2790 19.3356 3.4500 23.2919 44.1680 5.3904 55.3525 1.4516 4.5616 18.2825 14.5920 29.3555 34.3175 21.5824 6.6572 3.7570 20.3384 55.9346 1.7868 31.4488 10.6874 38.0829 72.0429 42.1972 56.9487 54.3710 32.6717 62.7062 22.0032 18.9540 30.3970 0.1849 21.5533 13.7383 18.7325 0.2859 34.7660 95.9702 25.0628 42.5831 23.0526 14.9575 9.8206 41.8725 3.6632 4.3257 18.6256 9.3873 0.8078
temp: 298.150 k
press: 1.00000 atm
elementType: 35 17 8 7 6 6 6 6 6 6 6 6 6 6 6 6 6 6 6 6 6 6 6 6 6 1 1 1 1 1 1 1 1 1 1 1 1 1 1 1 1 1 1 1 1 1 1 1 1 1 1 1
symmnumber: 1
zpe: 1124907.2 jmol-1
zpe.correction: 0.428455 hartree
zpe.thermalcorrener: 0.455107 hartree
zpe.thermalcorrenthalpy: 0.456051 hartree
zpe.thermalcorrgfe: 0.364691 hartree
zpe.sumelectzpe: -1418.030651 hartree
zpe.sumelectthermal: -1418.003999 hartree
zpe.sumelectthermalent: -1418.003054 hartree
zpe.sumelectthermalfe: -1418.094414 hartree
dipole: -0.1991 0.2804 -0.9699
dipole: 1.0291
quadrupole: -175.1574 -188.6193 -154.6808
quadrupole: -9.4384 9.0827 -3.1368
quadrupole: -2.3382 -15.8001 18.1384 -9.4384 9.0827 -3.1368
hfenergy: -1418.459105 hartree
pointgroup: C01 [X(C21H27Br1Cl1N1O1)]
dipole: 0.1866405 -0.0608845 0.3540929 debye
polarizability: 261.6588538|-21.1792297|276.5322731|1.3923029|15.1803818|262.8344701 unknown
InChI: InChI=1S/C21H27BrClNO/c1-16(2)20-9-4-17(3)14-21(20)25-13-12-24(11-10-23)15-18-5-7-19(22)8-6-18/h4-9,14,16H,10-13,15H2,1-3H3
charge 0 multiplicity 1
52 atoms
Br 5.203942 -2.398111 -3.78036
Cl 1.408137 5.824845 1.370322
O  -1.28593 -0.264111 0.684004
N  1.856409 1.730563 0.868508
C  0.892871 0.636957 1.133649
C  -2.970098 -2.363898 1.599127
C  3.28067 1.332079 0.940895
C  -3.381501 -1.422032 0.463829
C  -0.357786 0.787397 0.255626
C  1.554337 3.017394 1.536221
C  -2.52484 -0.375146 0.013189
C  3.709343 0.404194 -0.192978
C  -4.625319 -1.558141 -0.192207
C  -2.82465 -3.823599 1.089944
C  -3.964527 -2.290592 2.788217
C  -2.907079 0.487469 -1.040819
C  -4.161523 0.333487 -1.684662
C  1.692678 4.156128 0.515934
C  -5.018306 -0.702711 -1.247156
C  3.232882 0.603804 -1.512433
C  4.62965 -0.644677 0.045586
C  -4.560888 1.267253 -2.815586
C  3.66802 -0.216148 -2.57623
C  5.079793 -1.476329 -1.005983
C  4.591879 -1.248124 -2.308007
H  0.583692 0.592543 2.202412
H  1.373621 -0.326671 0.891636
H  -1.9813 -2.033959 1.963473
H  3.530383 0.854662 1.919848
H  3.88404 2.260302 0.888657
H  -0.089629 0.662444 -0.812486
H  -0.826805 1.78522 0.390875
H  0.520741 3.003702 1.924742
H  2.219958 3.21013 2.405894
H  -5.306727 -2.355416 0.12874
H  -2.089863 -3.886406 0.267205
H  -2.487236 -4.487836 1.90774
H  -3.789032 -4.213161 0.713003
H  -4.975243 -2.625862 2.488924
H  -3.625534 -2.941628 3.615904
H  -4.050975 -1.258248 3.17254
H  -2.238506 1.287306 -1.376897
H  2.703083 4.215841 0.083902
H  0.936356 4.088165 -0.279093
H  -5.992119 -0.841665 -1.730567
H  2.507113 1.403614 -1.695478
H  5.002846 -0.823527 1.061437
H  -3.838507 1.220711 -3.652462
H  -5.555609 1.00763 -3.216351
H  -4.599823 2.319831 -2.476249
H  3.295585 -0.055361 -3.592119
H  5.789125 -2.28571 -0.811159
