program: Gaussian 09
title: 000290939
version: EM64L-G09RevD.01
frameworkgroup: C1[X(C11H13F3N2)]
method: RPBEPBE
basis: SDD
operation: Freq
keyword: #p
keyword: freq=noraman
keyword: PBEPBE/SDD
title: #p freq=noraman PBEPBE/SDD
converged: YES YES NO NO
title: Mulliken charges:
elementType: F F F N N C C C C C C C C C C C H H H H H H H H H H H H H
charge: -0.165000 -0.170249 -0.170893 -0.104165 -0.066107 0.357252 0.299581 0.070422 -0.458277 -0.367648 -0.387535 -0.207262 -0.816134 0.232976 -0.591525 -0.632126 0.256194 0.283425 0.265690 0.234105 0.261242 0.237076 0.246059 0.211670 0.250503 0.215858 0.223170 0.229641 0.262059
chargesum: 0.00000
title: Mulliken charges with hydrogens summed into heavy atoms:
elementType: F F F N N C C C C C C C C C C C
charge: -0.165000 -0.170249 -0.170893 -0.104165 -0.066107 0.357252 0.299581 0.070422 -0.202083 -0.084223 -0.121845 0.026842 -0.071757 0.232976 0.086506 0.082743
polarizability: 2.36725231e+02 -1.13323654e+01 1.38588614e+02 3.33280891e+00 1.77134809e+00 7.83663002e+01
1716.lowfreq: -9.5148 -0.0007 -0.0002 0.0004 1.7986 4.2688 13.4760 28.4375 57.0112
frequency: 6.7788 28.4001 57.0024 85.5158 112.7723 121.2685 133.7620 166.8992 188.7485 210.3336 248.8156 262.5429 299.1353 305.2307 331.4404 340.8286 377.0376 384.1814 424.1931 434.6136 466.1553 479.3045 522.3465 529.6901 607.8529 632.6600 642.2629 696.6047 706.5633 788.9757 817.2340 825.0140 896.3208 939.8138 951.9689 979.3071 984.7919 1004.4380 1007.8276 1013.3077 1024.1396 1034.3047 1051.9697 1083.3885 1088.5143 1104.0115 1126.3957 1182.1336 1214.0587 1236.4509 1263.0770 1310.4342 1331.3404 1384.2779 1392.9156 1415.1456 1421.7799 1434.8694 1458.0787 1465.8721 1470.7610 1475.6781 1476.5892 1484.7292 1499.7512 1545.6084 1594.8459 1612.0054 2928.1753 2935.8045 2971.5072 3057.3479 3058.9982 3062.8754 3087.5392 3126.5093 3131.9523 3143.6207 3160.1819 3170.2479 3179.2336
redmass: 10.6125 3.6625 2.9900 4.0299 1.6942 3.3459 2.4472 2.6532 1.5995 2.3651 1.7474 5.3722 5.4028 2.5245 3.8667 4.4740 2.6261 5.0283 3.5182 4.9206 3.8331 4.7886 4.0189 7.6941 11.9157 5.7454 5.2324 2.0381 5.6384 5.6557 1.4491 5.1814 1.5646 1.4349 2.3524 8.2448 6.0425 5.2651 1.4061 1.6340 1.7589 2.1283 4.9763 1.2834 1.8891 1.6762 1.3997 1.1044 3.3072 2.2581 2.8384 1.3536 4.2124 1.2530 8.0739 1.1406 3.1334 1.2562 1.0593 1.0912 1.0835 1.1341 1.4312 1.3381 1.0891 5.3124 6.3657 6.0450 1.0516 1.0491 1.0389 1.0933 1.0856 1.0835 1.0991 1.0994 1.0983 1.0878 1.0910 1.0921 1.0982
irintensity: 0.0771 0.7580 6.3975 1.6278 2.4293 1.4271 1.0806 4.5190 1.0704 0.5217 2.8169 3.4236 5.3016 27.5444 28.6586 14.2803 5.3193 1.9287 5.9214 1.4357 31.5366 1.2930 9.3911 2.0331 18.0464 2.5024 7.4519 28.4140 2.7012 45.5359 59.6574 48.4939 27.7517 13.9970 15.8687 202.3218 24.8344 149.1829 6.1277 18.5310 21.1084 33.9205 186.3298 7.4608 39.7542 5.7850 27.1997 1.0601 20.4265 16.2650 280.6338 17.2124 72.7188 33.3126 2.3252 3.2640 13.8399 14.1316 10.4317 1.1116 20.8448 22.9397 37.8313 15.0905 23.5724 71.4837 2.3780 11.6129 67.3220 186.1689 14.8565 12.5405 10.2939 57.9721 16.2157 17.1259 12.2304 9.3552 3.5238 0.5644 8.1447
temp: 298.150 k
press: 1.00000 atm
elementType: 9 9 9 7 7 6 6 6 6 6 6 6 6 6 6 6 1 1 1 1 1 1 1 1 1 1 1 1 1
symmnumber: 1
zpe: 581439.3 jmol-1
zpe.correction: 0.221459 hartree
zpe.thermalcorrener: 0.237748 hartree
zpe.thermalcorrenthalpy: 0.238692 hartree
zpe.thermalcorrgfe: 0.175245 hartree
zpe.sumelectzpe: -834.765462 hartree
zpe.sumelectthermal: -834.749172 hartree
zpe.sumelectthermalent: -834.748228 hartree
zpe.sumelectthermalfe: -834.811675 hartree
dipole: 5.4440 0.3719 0.5970
dipole: 5.4892
quadrupole: -91.1314 -85.4464 -97.5315
quadrupole: -9.2115 3.0741 -0.3563
quadrupole: 0.2384 5.9233 -6.1617 -9.2115 3.0741 -0.3563
hfenergy: -834.98692 hartree
pointgroup: C01 [X(C11H13F3N2)]
dipole: 2.1405679 -0.1172231 -0.261162 debye
polarizability: 236.546417|12.1333711|138.1546571|-3.7504989|5.9611785|78.979071 unknown
InChI: InChI=1S/C11H13F3N2/c1-8(15-16(2)3)9-5-4-6-10(7-9)11(12,13)14/h4-7H,1-3H3
charge 0 multiplicity 1
29 atoms
F  -4.506861 -0.274202 -0.206225
F  -3.563484 1.149253 1.286996
F  -3.370897 1.553988 -0.928747
N  4.047493 0.243334 0.159241
N  2.759344 -0.324967 0.075247
C  0.377918 -0.299982 0.121567
C  -2.079647 -0.291593 -0.002735
C  1.675878 0.417065 0.2742
C  -0.85454 0.402161 0.142125
C  0.34025 -1.716192 -0.061871
C  -2.108682 -1.692351 -0.167337
C  -0.881773 -2.397344 -0.19579
C  1.682642 1.865513 0.731412
C  -3.351906 0.502196 0.032988
C  5.066114 -0.830483 0.111735
C  4.388844 1.378655 -0.740274
H  -0.872558 1.490475 0.253336
H  1.292858 -2.251953 -0.095153
H  -3.062179 -2.216654 -0.276371
H  -0.887334 -3.484642 -0.325662
H  2.621945 2.072605 1.27444
H  1.594284 2.590044 -0.10178
H  0.843593 2.055513 1.421799
H  5.179927 -1.259086 -0.908348
H  4.768609 -1.634172 0.800487
H  6.03669 -0.4186 0.438602
H  4.34053 1.072549 -1.809452
H  5.418554 1.702755 -0.513327
H  3.720886 2.237516 -0.592102
