program: Gaussian 09
title: 000290934
version: EM64L-G09RevD.01
frameworkgroup: C1[X(C9H9N3O2)]
method: RPBEPBE
basis: SDD
operation: Freq
keyword: #pfreq=noraman
keyword: PBEPBE/SDD
title: #p freq=noraman PBEPBE/SDD
converged: NO YES NO NO
title: Mulliken charges:
elementType: O O N N N C C C C C C C C C H H H H H H H H H
charge: -0.216442 -0.217267 -0.182408 -0.077302 0.012549 0.109704 0.327904 0.115043 -0.513668 -0.314936 0.403927 -0.363660 -0.763379 -0.626109 0.296721 0.250169 0.286392 0.253237 0.237682 0.237897 0.268849 0.237889 0.237206
chargesum: 0.00000
title: Mulliken charges with hydrogens summed into heavy atoms:
elementType: O O N N N C C C C C C C C C
charge: -0.216442 -0.217267 -0.182408 -0.077302 0.012549 0.109704 0.327904 0.115043 -0.216947 -0.064766 0.403927 -0.077267 -0.034563 0.117835
polarizability: 2.01897523e+02 2.02805694e+00 1.44436941e+02 3.53365151e-02 -5.36048771e-03 5.83209938e+01
1716.lowfreq: -11.1807 -8.5716 0.0006 0.0009 0.0010 2.6433 54.0805 58.4280 79.8789
frequency: 54.0668 58.4029 79.8724 106.0528 150.2694 159.5731 177.1777 236.9218 257.2331 281.5459 350.8339 352.4293 433.4713 483.2502 534.6917 556.8773 560.9224 611.5400 628.8823 631.2796 703.7526 735.7035 758.3172 763.5761 824.7927 866.2215 940.4002 950.7236 978.8277 992.9007 1034.2241 1044.1213 1083.1802 1121.7849 1131.6957 1153.1591 1216.0984 1221.3199 1264.9784 1326.3480 1363.9351 1382.4702 1400.7780 1405.6198 1436.2147 1446.7514 1465.5086 1471.2221 1473.1463 1476.6833 1486.9739 1517.7520 1582.9880 1622.0562 2987.1902 2987.6472 3063.9972 3069.3536 3110.5745 3131.4824 3161.5431 3180.4809 3187.9593
redmass: 1.1925 5.6442 3.2599 1.1323 4.7679 3.2294 3.7781 2.8980 5.0193 6.3110 7.1959 4.9836 2.9985 6.9012 5.3864 4.7942 4.0343 5.5410 6.4243 5.5144 5.8144 9.1724 4.3789 5.5257 1.5226 5.5331 1.4531 2.9711 1.3170 2.3499 2.0936 1.4905 2.7385 1.3008 1.4884 2.6215 7.1675 2.3299 1.6620 4.6206 5.8460 3.1232 1.2889 2.7586 1.4599 6.6001 1.0446 1.8189 1.0428 1.3748 1.6427 4.6060 7.9108 8.0144 1.0373 1.0363 1.0979 1.1022 1.0981 1.0983 1.0897 1.0930 1.0959
irintensity: 0.1438 0.0003 0.8510 0.3175 0.8331 5.4177 6.7372 2.8118 1.5775 0.2230 0.7962 0.0916 4.0749 2.2703 2.6944 1.7481 0.2726 10.1385 3.7687 13.0915 20.6819 23.0005 0.1281 7.1791 37.4926 0.1858 22.7099 11.8567 1.5028 3.9738 25.0452 1.9824 18.2256 0.5273 36.0627 22.7340 447.6380 51.7039 15.0483 4.3691 91.1547 31.7061 16.1707 32.0078 0.8045 20.7231 14.1744 4.1555 22.2461 32.0914 11.0159 27.2748 2.0707 99.1695 51.6972 25.3907 15.3885 23.5332 9.4092 1.6234 4.8897 1.6659 4.9394
temp: 298.150 k
press: 1.00000 atm
elementType: 8 8 7 7 7 6 6 6 6 6 6 6 6 6 1 1 1 1 1 1 1 1 1
symmnumber: 1
zpe: 449973.8 jmol-1
zpe.correction: 0.171386 hartree
zpe.thermalcorrener: 0.183879 hartree
zpe.thermalcorrenthalpy: 0.184823 hartree
zpe.thermalcorrgfe: 0.131748 hartree
zpe.sumelectzpe: -661.973418 hartree
zpe.sumelectthermal: -661.960925 hartree
zpe.sumelectthermalent: -661.959981 hartree
zpe.sumelectthermalfe: -662.013057 hartree
dipole: 5.6971 -2.0492 0.0027
dipole: 6.0544
quadrupole: -102.0065 -68.8480 -81.8167
quadrupole: -4.0473 0.0023 0.0033
quadrupole: -17.7827 15.3757 2.4070 -4.0473 0.0023 0.0033
hfenergy: -662.1448042 hartree
pointgroup: C01 [X(C9H9N3O2)]
dipole: 2.2234996 -0.8543763 0.0010623 debye
dipolederiv: -0.9418327 -0.2088635 -0.0000215 -0.2992604 -0.5904204 0.0000133 -0.0001147 -0.0000697 -0.2358881 -0.7286607 0.1763177 -0.000044 0.4225114 -0.7380223 0.0000122 -0.0000811 0.0000632 -0.2349618 -0.847328 -0.0896883 -0.0013959 0.0976629 -0.5390336 0.0009822 0.0055208 -0.0026676 -0.0972874 -0.4380181 0.1320976 0.0004042 0.0613898 0.2658688 0.0000043 -0.0007108 0.0001686 -0.2202146 2.1647054 -0.0462887 0.0001555 -0.2605429 1.0685679 -0.0000418 0.0001068 0.0000732 0.1825485 -0.4845072 -0.0639582 0.0001179 0.3331566 -0.2749738 0.0003187 -0.0004403 -0.0002208 0.0115319 0.804397 -0.0425383 0.0003827 -0.2381338 -0.1889254 -0.0001556 -0.0010798 0.0006338 0.0599876 0.2954321 0.3106641 -0.0005122 0.3066616 0.4419664 0.0003618 0.0001973 0.0013094 -0.0209483 0.5980665 0.0716411 0.0000706 0.2049489 -0.004822 0.0001538 0.0000218 -0.0000556 -0.0906327 -0.3314082 0.0443999 -0.0000369 -0.0861803 0.1269413 -0.0004007 -0.0001056 -0.0001028 -0.1569874 -1.02555 0.0161865 -0.0001722 0.0244533 -0.0967075 0.0000246 0.0000039 -0.0000225 0.0366314 0.1565076 -0.062222 0.0000484 -0.3252283 0.0763139 0.0000016 0.0001276 -0.0000642 -0.1284078 0.0321244 0.0143742 0.0002014 -0.0388924 -0.1216192 -0.0001154 -0.0001936 -0.0014174 0.0750291 0.3292068 -0.2402179 0.0026477 -0.3404397 0.3910409 -0.0017901 -0.0001823 -0.0006209 0.2307516 0.1246874 0.0248868 0.0000054 0.0130453 0.0508603 -0.0000377 -0.0000118 -0.0000197 0.1647552 0.0606088 0.0664281 -0.0000553 0.0385088 -0.0511227 0.0001006 -0.0001751 0.0000252 0.1667925 0.0863836 -0.0745388 0.0000084 -0.017329 0.0817856 0.0000015 0.0000255 0.0000095 0.1706415 -0.0940853 -0.1009297 0.0013077 -0.0081798 0.0815394 0.000036 0.0013117 0.0007369 0.1218186 0.0680562 0.0486665 -0.0964527 -0.0045206 0.0044887 0.0442104 -0.0589818 0.0947294 -0.0313537 0.0702527 0.0471989 0.0949842 -0.0052779 0.0038679 -0.0444867 0.0578048 -0.0950758 -0.0337578 -0.0313481 -0.0034992 0.0023041 -0.1008948 0.1020675 0.0021831 0.002425 0.0010607 0.1359807 0.0657779 -0.0071441 0.06412 0.1133977 -0.0438088 0.0774744 -0.0152376 0.1159684 -0.0561715 0.0665319 -0.0129729 -0.0680673 0.1091434 -0.045853 -0.0788506 0.0097694 -0.1144415 -0.0498576 unknown
polarizability: 201.9582553|0.7871708|144.3762093|0.0352127|-0.0061214|58.3209938 unknown
InChI: InChI=1S/C9H9N3O2/c1-6-8-5-7(12(13)14)3-4-9(8)11(2)10-6/h3-5H,1-2H3
charge 0 multiplicity 1
23 atoms
O  -3.966908 -0.781582 0.000196
O  -3.467057 1.443854 0.000193
N  2.388284 -0.811681 -0.000792
N  2.919266 0.496335 -0.000492
N  -3.121282 0.197301 0.000383
C  0.61513 0.586485 0.000279
C  1.007517 -0.801128 -0.00004
C  1.853233 1.338958 0.000157
C  -0.753189 0.930176 0.000378
C  0.058066 -1.855638 0.000057
C  -1.680883 -0.128253 0.00028
C  -1.29717 -1.504968 0.000193
C  2.044469 2.82668 0.000581
C  3.295651 -1.956702 0.000943
H  -1.108024 1.963984 0.000557
H  0.363906 -2.905576 0.000203
H  -2.08372 -2.263662 0.000264
H  3.11894 3.069663 -0.005951
H  1.576551 3.291328 -0.88663
H  1.588176 3.289341 0.894919
H  4.323718 -1.566431 -0.015302
H  3.15735 -2.570893 0.908994
H  3.135677 -2.589391 -0.890573
