program: Gaussian 09
title: 000290924
version: EM64L-G09RevD.01
frameworkgroup: C1[X(C10H13BrN2)]
method: RPBEPBE
basis: SDD
operation: Freq
keyword: #p
keyword: freq=noraman
keyword: PBEPBE/SDD
title: #p freq=noraman PBEPBE/SDD
converged: YES YES NO NO
title: Mulliken charges:
elementType: Br N N C C C C C C C C C C H H H H H H H H H H H H H
charge: -0.002073 -0.107595 -0.074085 0.339894 0.080612 -0.360349 -0.360434 -0.815882 -0.200922 -0.190737 -0.209516 -0.632223 -0.593835 0.234270 0.281888 0.233378 0.264005 0.239534 0.247273 0.247560 0.220751 0.258563 0.227633 0.209438 0.213520 0.249331
chargesum: 0.00000
title: Mulliken charges with hydrogens summed into heavy atoms:
elementType: Br N N C C C C C C C C C C
charge: -0.002073 -0.107595 -0.074085 0.339894 0.080612 -0.126079 -0.078546 -0.078964 0.046352 0.056823 -0.209516 0.074723 0.078454
polarizability: 2.75102725e+02 -9.52651760e+00 1.30087088e+02 2.41007029e+00 -2.99505871e-01 7.05628654e+01
1716.lowfreq: -6.5855 -0.0004 0.0005 0.0005 3.5838 7.8946 39.8861 47.6804 71.7366
frequency: 39.8646 47.6642 71.7324 113.1715 137.8195 160.5427 188.9860 202.6413 221.2399 254.4285 269.7872 320.2425 353.2445 362.8746 395.6174 411.8542 458.3914 471.6815 492.7338 552.6606 623.3691 661.3658 716.1222 772.2641 799.4913 823.9401 845.9483 947.5285 952.6682 989.6288 991.5264 1013.9303 1023.0662 1030.9450 1057.0178 1073.4345 1084.0722 1115.2538 1126.6402 1185.9682 1211.8523 1235.1227 1293.2212 1317.6114 1355.2527 1380.7659 1394.4284 1414.8992 1433.7348 1456.9480 1464.5249 1469.6552 1472.5093 1475.1958 1483.2971 1500.1788 1538.2940 1572.2583 1593.1347 2923.8774 2930.8958 2971.8106 3056.0799 3057.7264 3060.2737 3088.4189 3122.7102 3126.2621 3146.4599 3155.6889 3170.8962 3176.2305
redmass: 3.0597 4.5299 4.0754 3.6615 1.9621 1.4229 1.2806 5.0351 4.0558 1.7333 3.6936 2.5816 2.3482 3.2714 3.3488 2.9888 3.8715 3.1158 4.0028 2.8272 7.0452 4.9626 3.4892 4.1103 5.9180 1.3465 1.4160 2.4938 1.3642 3.0784 1.5827 1.6438 2.0848 1.7733 3.2814 1.8966 1.3175 1.3627 1.3994 1.1485 3.1422 2.2775 1.2545 3.8499 3.9379 1.4029 3.3081 1.1394 1.2028 1.0570 1.2054 1.1714 1.3791 1.0958 1.1809 1.0756 5.1850 7.3640 6.2458 1.0515 1.0495 1.0385 1.0842 1.0923 1.0843 1.0993 1.0986 1.0993 1.0878 1.0883 1.0957 1.0969
irintensity: 0.9672 1.4699 3.9245 3.2538 3.7714 1.4467 0.8019 2.0312 0.5233 3.9433 1.1209 62.6325 14.2555 12.0554 4.6416 1.6210 6.1133 33.4188 8.7348 23.0575 0.5533 11.7637 1.7293 6.7916 21.4128 23.1557 42.2258 73.6500 2.1056 34.3989 8.8486 17.1175 84.9905 47.0481 20.9357 14.6623 3.8731 15.0696 27.8739 0.8128 6.7307 4.0959 0.1792 19.4868 2.7538 26.3453 21.1359 3.0026 6.6113 11.3827 15.2015 50.9034 64.3043 17.8496 14.3262 27.8141 15.3285 11.0152 13.8687 65.9780 204.9208 16.8026 11.8488 9.7038 66.9372 17.1386 18.6364 14.7393 9.2635 1.0518 11.8802 2.5128
temp: 298.150 k
press: 1.00000 atm
elementType: 35 7 7 6 6 6 6 6 6 6 6 6 6 1 1 1 1 1 1 1 1 1 1 1 1 1
symmnumber: 1
zpe: 546762.6 jmol-1
zpe.correction: 0.208251 hartree
zpe.thermalcorrener: 0.222045 hartree
zpe.thermalcorrenthalpy: 0.222989 hartree
zpe.thermalcorrgfe: 0.166391 hartree
zpe.sumelectzpe: -510.807373 hartree
zpe.sumelectthermal: -510.793579 hartree
zpe.sumelectthermalent: -510.792634 hartree
zpe.sumelectthermalfe: -510.849232 hartree
dipole: 4.1139 1.2374 0.6959
dipole: 4.3519
quadrupole: -77.9538 -78.5213 -90.9110
quadrupole: -0.0150 3.8418 0.6950
quadrupole: 4.5082 3.9407 -8.4490 -0.0150 3.8418 0.6950
hfenergy: -511.0156235 hartree
pointgroup: C01 [X(C10H13Br1N2)]
dipole: -1.5944402 -0.5156788 0.3512969 debye
dipolederiv: -0.8998217 -0.1343232 -0.0178276 -0.1747904 -0.1030962 0.003248 -0.0393395 0.0026028 -0.0500188 -1.5132238 0.2746218 0.0337278 -0.8512001 -0.1866492 -0.0845209 -0.4692519 0.0378307 -0.3332112 0.8638129 -0.249029 0.0188967 0.190375 -0.3798985 0.0913223 0.4412378 0.0006628 -0.2301795 0.4985156 -0.0651963 0.0073421 -0.0116554 -0.1567176 -0.0000905 0.0692294 0.0079307 0.0038346 0.0330758 0.2092891 0.0040307 0.4704684 0.3756354 0.0014615 -0.2681962 -0.0204242 -0.0400966 -0.1079705 0.0625975 0.0001041 0.0555103 0.0220495 -0.054421 -0.0289083 -0.0503076 -0.1486925 -0.1565977 -0.0583465 0.0209968 -0.0617022 0.0116241 -0.0238165 -0.0085886 -0.0342773 -0.1146598 -0.1322654 -0.0594737 -0.0261852 -0.1527924 -0.2377107 0.0071008 -0.0840008 0.0542473 0.1080583 -0.3391298 -0.1678204 0.0276872 -0.2016765 -0.0331053 -0.0277697 0.0342153 -0.0335238 -0.0903383 -0.3437411 0.0343116 -0.0328996 -0.0419556 0.0567953 -0.0450403 -0.0100832 -0.0346207 -0.0897358 1.3174598 0.2471323 0.0451551 0.334336 0.0792571 -0.0331002 0.057376 -0.029841 -0.1222708 0.2611332 0.054727 -0.0904964 0.4757684 0.0825804 0.0508177 -0.271334 0.1086618 0.3770732 0.3014768 -0.1373381 0.0860027 -0.3805293 0.4313319 0.0530649 0.2706487 -0.0031344 0.1995619 0.0610124 -0.0741346 0.0142272 -0.0717804 -0.0650217 0.0489746 0.0140608 0.0487052 0.1335348 0.0757073 0.0786999 -0.0265939 0.0379996 0.0389592 0.0258802 -0.0215467 0.0298764 0.1370225 0.1175418 -0.0405516 0.0160466 0.0201401 0.0278042 0.0304387 0.0345357 0.088346 -0.0939104 -0.0686189 -0.0882549 -0.0710392 0.0184281 0.116938 0.0201444 -0.0596396 -0.0244249 0.065489 0.0067645 0.1376251 0.0919247 0.0933684 0.0206594 -0.0340133 0.088093 -0.0534619 0.0627296 0.0087172 0.0765794 -0.0302338 0.0849643 0.0216046 0.0416087 -0.0322735 0.042872 0.1484371 0.0639205 -0.0568775 0.0079603 -0.0660973 -0.0342379 0.0440493 0.0174533 0.041973 0.1475816 0.0454254 -0.0528021 -0.0301328 0.0310411 -0.038588 -0.170273 0.2414928 -0.0917793 -0.154475 0.1343327 0.0760543 -0.0407564 0.0167297 -0.0907832 0.0816081 -0.0169424 0.0587731 0.03774 -0.2110804 -0.0237528 0.0007852 0.0014148 0.1181689 -0.0113177 -0.0264291 -0.0064659 0.0599009 0.0783648 -0.0005598 -0.0414726 0.2209932 -0.173532 -0.0610362 0.0532437 -0.1920033 -0.0652985 -0.2065961 0.0079778 -0.0768804 -0.0481846 0.047065 -0.0090144 -0.0342172 -0.0116524 0.1054183 0.1117846 -0.0511554 0.1096308 0.0108273 0.0488672 0.0546946 0.0491645 0.0634348 -0.0534946 unknown
polarizability: 275.6869519|-0.1507759|126.6017684|3.6702435|-12.6755633|73.4639576 unknown
InChI: InChI=1S/C10H13BrN2/c1-8(12-13(2)3)9-4-6-10(11)7-5-9/h4-7H,1-3H3
charge 0 multiplicity 1
26 atoms
Br 5.072287 0.716569 0.029769
N  -3.290611 0.286483 -0.355336
N  -1.881829 0.469855 -0.326909
C  0.373901 -0.275774 -0.100649
C  -1.084855 -0.576862 -0.147224
C  1.327109 -1.279508 0.227332
C  0.856513 1.037981 -0.376293
C  -1.555117 -2.020061 -0.084103
C  2.710637 -0.995144 0.270239
C  2.231465 1.334943 -0.347052
C  3.148791 0.30996 -0.022881
C  -3.93492 -0.231675 0.882073
C  -3.929529 1.535404 -0.829739
H  1.001817 -2.296992 0.46628
H  0.126387 1.816668 -0.613699
H  -1.667949 -2.396978 0.951296
H  -2.530843 -2.106203 -0.594476
H  -0.837301 -2.681101 -0.598782
H  3.428684 -1.778692 0.528312
H  2.585536 2.345654 -0.570292
H  -3.771316 0.455559 1.742831
H  -3.556286 -1.22714 1.152856
H  -5.019774 -0.315904 0.699635
H  -3.877286 2.35177 -0.075451
H  -4.988371 1.32911 -1.064564
H  -3.420244 1.870581 -1.744972
