program: Gaussian 09
title: 000290922
version: EM64L-G09RevD.01
frameworkgroup: C1[X(C15H16N2)]
method: RPBEPBE
basis: SDD
operation: Freq
keyword: #pfreq=noraman
keyword: PBEPBE/SDD
title: #p freq=noraman PBEPBE/SDD
converged: YES YES NO NO
title: Mulliken charges:
elementType: N N C C C C C C C C C C C C C C C H H H H H H H H H H H H H H H H
charge: -0.030281 -0.083958 -0.093840 0.322951 0.294981 -0.383790 -0.393028 -0.385496 -0.404884 -0.241588 -0.228142 -0.235240 -0.228819 -0.251258 -0.244175 -0.606724 -0.635234 0.248695 0.260692 0.258623 0.272180 0.221187 0.226761 0.220403 0.227409 0.224222 0.228450 0.219770 0.259699 0.218432 0.251311 0.264237 0.226453
chargesum: 0.00000
title: Mulliken charges with hydrogens summed into heavy atoms:
elementType: N N C C C C C C C C C C C C C C C
charge: -0.030281 -0.083958 -0.093840 0.322951 0.294981 -0.135095 -0.132336 -0.126873 -0.132704 -0.020401 -0.001381 -0.014837 -0.001410 -0.027035 -0.015725 0.091177 0.106768
polarizability: 2.41367169e+02 -7.23003489e+00 2.15050435e+02 9.58041395e+00 2.72081123e-01 1.08971105e+02
1716.lowfreq: -19.8694 -9.6671 -0.0003 -0.0003 0.0008 9.5041 34.1295 48.4798 56.2376
frequency: 33.9553 48.1757 55.8031 75.1437 77.4360 89.1401 129.6676 139.2320 202.3678 218.4224 257.8018 277.2571 289.5275 323.3348 360.3204 402.3471 408.8847 450.0065 471.5347 505.8199 578.8151 607.4239 616.2329 634.5374 658.6809 698.8713 707.9682 728.6099 765.8002 781.3329 813.2428 851.6987 861.7761 917.8633 927.0834 949.6002 978.9701 984.6982 987.1553 987.7000 992.2813 996.7009 1015.1428 1028.6842 1031.3996 1035.4623 1077.5365 1084.4030 1085.5284 1116.5293 1165.7330 1169.5629 1171.2289 1187.3264 1190.1952 1240.7133 1274.1325 1301.8724 1316.0781 1324.4877 1368.0981 1379.9399 1420.6693 1424.0703 1429.7604 1438.6045 1451.7299 1470.3973 1474.1745 1478.0194 1478.9104 1482.6351 1528.1541 1576.4230 1581.3742 1602.9686 1608.7865 2936.5759 2967.2421 3046.2752 3049.2403 3081.4493 3119.2660 3120.0634 3125.5331 3128.8635 3128.9502 3138.6023 3145.7344 3146.8523 3156.8691 3162.3276 3167.0073
redmass: 3.5738 2.6828 1.7347 3.3755 4.1461 3.2053 1.4053 1.7092 3.0168 3.5703 3.7732 4.3344 4.3068 4.3739 4.3362 2.8665 2.8987 3.3129 3.7117 3.5348 5.6379 6.0916 6.3487 4.9814 5.7281 1.7688 1.7685 4.3680 1.9524 2.2720 4.5031 1.2528 1.2461 1.7371 1.4770 3.2439 1.3942 1.4135 5.7791 5.5063 1.3108 1.3138 2.8674 1.9961 1.9561 1.6243 1.6248 1.3398 1.4411 1.3394 2.2905 1.1289 1.0560 1.1325 1.1396 3.6118 3.1409 2.4734 1.4150 1.7170 6.3191 7.4273 1.1603 1.5773 2.1931 1.6962 1.0560 1.1339 1.7962 1.6587 1.1737 1.2442 5.0554 5.7991 6.1584 5.9232 6.1331 1.0474 1.0332 1.0880 1.1009 1.1010 1.0843 1.0846 1.0875 1.0886 1.0980 1.0923 1.0938 1.0957 1.0960 1.1016 1.0987
irintensity: 0.8609 1.4199 5.3972 0.7901 0.7415 0.7651 0.3011 1.6777 4.6154 7.0905 1.5574 5.8534 5.2699 4.2776 1.1519 0.4934 0.2530 3.1715 6.0900 9.1133 11.3696 2.5104 0.2868 17.4066 8.7245 55.2848 47.5399 13.6395 39.0898 44.9016 4.8594 0.6703 0.0192 6.0760 3.9061 11.9946 1.4550 0.3413 1.0951 0.4126 0.6874 0.5877 92.0480 7.2474 28.8606 30.9625 7.9554 4.0344 0.8229 26.6634 1.5017 0.1800 0.0125 1.2433 0.9156 8.3244 29.0827 3.4092 7.4369 5.3314 0.9925 2.8706 13.6893 50.5345 3.5863 8.7100 23.6971 13.3533 9.2749 57.3151 1.6553 15.1023 139.5856 1.9179 4.9038 11.9793 5.9116 140.0590 78.4627 35.2573 21.5557 26.5343 3.2322 2.6647 1.1946 12.0051 11.2147 16.8415 46.1360 18.8008 27.7184 27.2898 15.3802
temp: 298.150 k
press: 1.00000 atm
elementType: 7 7 6 6 6 6 6 6 6 6 6 6 6 6 6 6 6 1 1 1 1 1 1 1 1 1 1 1 1 1 1 1 1
symmnumber: 1
zpe: 708636.7 jmol-1
zpe.correction: 0.269905 hartree
zpe.thermalcorrener: 0.285761 hartree
zpe.thermalcorrenthalpy: 0.286705 hartree
zpe.thermalcorrgfe: 0.225402 hartree
zpe.sumelectzpe: -689.439719 hartree
zpe.sumelectthermal: -689.423864 hartree
zpe.sumelectthermalent: -689.422919 hartree
zpe.sumelectthermalfe: -689.484223 hartree
dipole: -2.7324 0.7704 0.8097
dipole: 2.9522
quadrupole: -91.3405 -87.8493 -101.3324
quadrupole: -2.7169 1.8135 0.7218
quadrupole: 2.1669 5.6581 -7.8250 -2.7169 1.8135 0.7218
hfenergy: -689.7096246 hartree
pointgroup: C01 [X(C15H16N2)]
dipole: 1.0690217 0.3827175 -0.2444015 debye
polarizability: 241.3929261|5.27555|209.2639644|9.8877338|24.4051825|114.7318182 unknown
InChI: InChI=1S/C15H16N2/c1-17(2)16-15(13-9-5-3-6-10-13)14-11-7-4-8-12-14/h3-12H,1-2H3
charge 0 multiplicity 1
33 atoms
N  0.112298 1.78546 0.585874
N  1.317212 2.442168 0.635241
C  -0.060299 0.536106 0.139829
C  -1.488655 0.103969 0.059429
C  1.014136 -0.470695 -0.15288
C  -1.85534 -1.271965 0.091499
C  1.01771 -1.226754 -1.357763
C  -2.530312 1.072949 -0.034842
C  2.022753 -0.738746 0.814327
C  -3.211327 -1.661852 0.035244
C  2.011014 -2.200182 -1.5994
C  -3.882758 0.681878 -0.08275
C  3.009576 -1.721912 0.579132
C  -4.234149 -0.689854 -0.051663
C  3.012931 -2.452619 -0.631538
C  1.196687 3.819669 1.144352
C  2.466961 2.161398 -0.253031
H  -1.078557 -2.038867 0.177675
H  0.239075 -1.041404 -2.106513
H  -2.25134 2.130494 -0.06369
H  2.014753 -0.18623 1.761007
H  -3.469368 -2.72681 0.067343
H  2.003071 -2.762993 -2.539868
H  -4.666294 1.445354 -0.155083
H  3.771387 -1.920137 1.341881
H  -5.285893 -0.994367 -0.097806
H  3.780671 -3.212243 -0.816691
H  2.122654 4.106631 1.67384
H  0.353565 3.855639 1.848915
H  1.012597 4.552814 0.329315
H  2.114886 1.755139 -1.219824
H  3.174945 1.431106 0.179289
H  3.002411 3.108255 -0.440048
