program: Gaussian 09
title: 000290899
version: EM64L-G09RevD.01
frameworkgroup: C1[X(C16H18O5)]
method: RPBEPBE
basis: SDD
operation: Freq
keyword: #pfreq=noraman
keyword: PBEPBE/SDD
title: #p freq=noraman PBEPBE/SDD
converged: NO YES NO NO
title: Mulliken charges:
elementType: O O O O O C C C C C C C C C C C C C C C C H H H H H H H H H H H H H H H H H H
charge: -0.267061 -0.269507 -0.342717 -0.177131 -0.311278 0.324541 0.311556 -0.554300 -0.530750 0.074948 -0.101186 0.297637 0.279562 0.088297 0.190514 0.049474 -0.626670 -0.714358 -0.720986 -0.720194 -0.713548 0.245451 0.246462 0.256069 0.247848 0.283249 0.247628 0.222921 0.232827 0.234332 0.214025 0.231455 0.238054 0.212546 0.233407 0.244356 0.238579 0.222395 0.381551
chargesum: 0.00000
title: Mulliken charges with hydrogens summed into heavy atoms:
elementType: O O O O O C C C C C C C C C C C C C C C C
charge: -0.267061 -0.269507 0.038834 -0.177131 -0.311278 0.324541 0.311556 -0.062387 -0.026832 0.074948 -0.101186 0.297637 0.279562 0.088297 0.190514 0.049474 -0.343421 -0.010982 -0.041174 -0.036187 -0.008217
polarizability: 2.98866360e+02 -3.63596391e+00 1.95723874e+02 7.94840978e+00 1.12676706e-01 1.19659862e+02
1716.lowfreq: -13.2512 -8.1138 -6.3238 -0.0004 -0.0004 0.0005 38.1034 46.4554 81.0077
frequency: 38.0139 46.2489 80.9810 97.7625 104.1975 138.2682 156.3001 176.0620 186.5789 205.2527 220.5210 227.4347 243.3496 247.0147 252.0697 270.0438 296.3477 305.6285 318.2932 337.9258 377.6405 384.5428 410.1150 418.5336 423.9887 441.1282 463.6738 482.9871 498.8420 551.3562 555.2791 584.2000 595.7902 608.1154 627.2514 637.8062 667.0297 696.7276 767.4033 779.1309 807.1994 816.9113 842.3578 850.8804 859.3663 909.0060 915.1177 933.8055 933.9323 953.9877 968.7739 983.6855 1008.8510 1009.9951 1046.6730 1060.3803 1073.2628 1105.6916 1115.7465 1149.3122 1173.0349 1183.7754 1215.2952 1227.4675 1231.8212 1263.0057 1269.9463 1294.1659 1315.4702 1324.2452 1335.9671 1383.1642 1384.1096 1387.9051 1393.1856 1398.7098 1400.2946 1423.3111 1431.1605 1432.3306 1446.1384 1456.2386 1456.4129 1463.7390 1465.0180 1472.9124 1473.1887 1485.2617 1486.5660 1543.0229 1571.6783 1590.1894 1644.3120 2633.8580 2988.6700 2989.0449 2992.6901 2993.0022 2996.2506 2997.3781 3075.5214 3080.1252 3088.6531 3090.0187 3095.8923 3097.6429 3099.7125 3100.7594 3102.5734 3104.8839 3193.1825
redmass: 5.2389 4.1606 3.6460 4.4121 3.6958 6.1830 3.9637 1.0633 1.0943 2.9856 1.4518 1.1595 3.9418 5.1073 2.0665 2.4101 3.7542 3.1070 6.6072 2.9363 3.2836 4.0951 3.5607 3.1768 3.3100 6.3993 4.3225 3.3378 5.1262 4.9153 4.7757 4.7401 6.4913 4.7833 5.4387 3.7480 5.1147 6.3588 4.7131 6.0071 4.1258 4.6631 3.2953 3.2734 1.7285 1.8862 1.8901 1.4257 1.4205 2.0651 1.7898 1.0726 1.4271 1.4287 3.2885 4.1456 8.5906 1.6787 1.6876 1.8147 2.1302 2.1753 2.8910 1.9348 1.9845 2.3646 2.4367 4.0633 2.0245 2.1806 8.9400 1.2371 1.2427 3.6085 3.7602 1.2442 1.2603 1.3756 1.4605 1.8603 3.9034 1.0664 1.0778 1.0492 1.0491 1.0688 1.0677 1.0542 1.0545 6.2816 4.3462 7.4331 4.1594 1.0771 1.0624 1.0624 1.0355 1.0366 1.0377 1.0371 1.0959 1.0969 1.0992 1.0992 1.1002 1.0998 1.1000 1.1006 1.1002 1.0999 1.0925
irintensity: 2.5622 1.0594 0.3751 0.4908 3.1672 1.9006 1.1056 0.0586 0.1541 1.5363 0.7066 0.0664 0.0943 0.3555 0.6884 1.3230 1.4470 2.2548 0.7996 2.6998 12.2335 5.1834 0.6301 4.5684 3.0659 0.2498 12.9587 0.2225 8.5569 18.7150 50.2633 4.0176 0.3220 18.4123 2.8179 2.1525 5.2154 6.6007 1.9832 0.8146 34.4067 9.9193 33.6296 2.6799 38.1457 3.3957 3.9211 0.5755 1.0059 1.1963 5.2451 121.0124 0.4038 3.4356 38.8456 140.0255 84.2007 11.8036 10.6902 420.3808 22.6980 5.0597 264.0947 21.9292 17.7804 28.4323 27.2287 13.7987 76.6828 34.5575 98.0079 31.8650 32.2544 319.9995 22.1695 31.4646 29.7730 15.3805 1.9753 24.2912 144.7098 14.0397 3.6235 4.9290 5.0029 12.5052 6.4169 7.5814 14.0838 182.6816 158.9525 542.2571 709.2225 358.3793 11.1873 9.0595 12.4718 10.0732 19.0195 16.6332 6.0692 5.9664 20.9320 13.9473 19.1963 21.3702 29.1644 14.7064 29.9069 29.7912 0.2191
temp: 298.150 k
press: 1.00000 atm
elementType: 8 8 8 8 8 6 6 6 6 6 6 6 6 6 6 6 6 6 6 6 6 1 1 1 1 1 1 1 1 1 1 1 1 1 1 1 1 1 1
symmnumber: 1
zpe: 807525.2 jmol-1
zpe.correction: 0.307570 hartree
zpe.thermalcorrener: 0.327218 hartree
zpe.thermalcorrenthalpy: 0.328162 hartree
zpe.thermalcorrgfe: 0.261013 hartree
zpe.sumelectzpe: -995.098757 hartree
zpe.sumelectthermal: -995.079110 hartree
zpe.sumelectthermalent: -995.078165 hartree
zpe.sumelectthermalfe: -995.145314 hartree
dipole: -1.7343 -5.7358 0.0649
dipole: 5.9926
quadrupole: -94.3533 -145.7451 -119.8890
quadrupole: -4.9674 -1.9755 -0.6570
quadrupole: 25.6424 -25.7493 0.1068 -4.9674 -1.9755 -0.6570
hfenergy: -995.4063273 hartree
pointgroup: C01 [X(C16H18O5)]
dipole: -0.6799755 2.2563209 -0.072328 debye
polarizability: 299.0738864|3.4632308|195.7036549|-5.2546199|-1.0553355|119.4725548 unknown
InChI: InChI=1S/C16H18O5/c1-15(2)6-8(17)12-10(20-15)5-11-13(14(12)19)9(18)7-16(3,4)21-11/h5,19H,6-7H2,1-4H3
charge 0 multiplicity 1
39 atoms
O  2.347043 1.591146 -0.077378
O  -2.3728 1.617192 0.171133
O  -0.053065 -2.674345 0.045583
O  2.721735 -2.574367 -0.220403
O  -2.574659 -2.572072 0.333619
C  3.697665 0.923212 0.131573
C  -3.690433 0.928513 -0.157285
C  3.700919 -0.392772 -0.66814
C  -3.738692 -0.4322 0.576176
C  1.246561 -0.63338 -0.069061
C  -1.249412 -0.580438 0.128862
C  1.207901 0.805482 -0.030389
C  -1.214697 0.854245 0.101401
C  2.539932 -1.325396 -0.284227
C  -2.502302 -1.278313 0.320139
C  -0.007003 -1.314816 0.035578
C  0.00184 1.541761 0.039116
C  3.874625 0.698038 1.646084
C  4.695901 1.947538 -0.41843
C  -4.74687 1.902622 0.374438
C  -3.767702 0.77065 -1.688818
H  4.646081 -0.939676 -0.510447
H  3.618353 -0.16189 -1.749457
H  -3.811383 -0.261418 1.669404
H  -4.632378 -1.003531 0.271222
H  0.02997 2.632638 0.043376
H  3.123131 -0.003633 2.047124
H  4.87474 0.274149 1.847417
H  3.785469 1.656209 2.185565
H  4.612651 2.901368 0.130482
H  5.727207 1.568677 -0.306843
H  4.505964 2.143213 -1.487627
H  -4.663375 2.877033 -0.135972
H  -5.760234 1.500627 0.197444
H  -4.615996 2.066058 1.45781
H  -2.983874 0.095385 -2.073175
H  -3.652227 1.753506 -2.175955
H  -4.749171 0.351772 -1.97512
H  -1.055217 -2.955288 0.139578
